<h4>Build status: FAILURE</h4>
Build worker for this Build: <b>centos7-a.osl.yoctoproject.org</b>
<br>
Complete logs for all build steps: <a href="http://autobuilder.yoctoproject.org/main/builders/nightly-deb/builds/285">http://autobuilder.yoctoproject.org/main/builders/nightly-deb/builds/285</a>
<br>
Build Reason: Triggerable(trigger_main-build)
<br>
Build Properties:<br>
<ul>
<li>Contents of bblayers.conf (Note. LCONF_VERSION will not show up correctly)<br><code>
LCONF_VERSION = <LCONF> <br>
BBPATH = "${TOPDIR}" <br>
BBFILES ?="" <br>
BBLAYERS += " \ <br>
/home/pokybuild/yocto-autobuilder/yocto-worker/nightly-deb/build/meta \ <br>
/home/pokybuild/yocto-autobuilder/yocto-worker/nightly-deb/build/meta-yocto \ <br>
/home/pokybuild/yocto-autobuilder/yocto-worker/nightly-deb/build/meta-yocto-bsp \ <br>
/home/pokybuild/yocto-autobuilder/yocto-worker/nightly-deb/build/meta-qt3 \ <br>
" <br>
<br></code></li>
<li>DEST : /srv/www/vhosts/autobuilder.yoctoproject.org/pub/nightly/20150510-2</li>
<li>DISTRO : poky</li>
<li>Contents of auto.conf (local.conf for autobuilders)<br><code>
INHERIT += "toaster"<br>
INHERIT += "report-error"<br>
DISTRO = "poky"<br>
PACKAGE_CLASSES = "package_deb"<br>
BB_NUMBER_THREADS = "16"<br>
PARALLEL_MAKE = "-j 16"<br>
SDKMACHINE ?= "i686"<br>
BB_TASK_NICE_LEVEL = "5"<br>
IMAGE_FSTYPES_append = " tar.gz"<br>
BB_TASK_NICE_LEVEL_task-testimage = "0"<br>
DL_DIR = "/srv/www/vhosts/autobuilder.yoctoproject.org/current_sources"<br>
SSTATE_DIR ?= "/srv/www/vhosts/autobuilder.yoctoproject.org/pub/sstate/" <br>
MACHINE = "qemux86"<br>
PREMIRRORS = ""<br>
BB_GENERATE_MIRROR_TARBALLS = "1"<br>
ADTREPO = "http://adtrepo.yoctoproject.org//1.8+snapshot"<br>
<br></code></li>
<li>MACHINE : qemux86</li>
<li>branch : master-next</li>
<li>branch_bitbake : master</li>
<li>branch_eclipse-poky-juno : juno-master</li>
<li>branch_eclipse-poky-kepler : kepler-master</li>
<li>branch_eclipse-poky-luna : luna-master</li>
<li>branch_meta-fsl-arm : master</li>
<li>branch_meta-fsl-ppc : master</li>
<li>branch_meta-intel : master</li>
<li>branch_meta-minnow : master</li>
<li>branch_meta-qt3 : master</li>
<li>branch_oecore : master</li>
<li>branch_poky : master-next</li>
<li>builddir : /home/pokybuild/yocto-autobuilder/yocto-worker/nightly-deb</li>
<li>buildername : nightly-deb</li>
<li>buildnumber : 285</li>
<li>commit-description : fido-13.0.0</li>
<li>commit_bitbake : 3e12f4e8e3ec66d1df772a64be04b90ec72462ae</li>
<li>commit_eclipse-poky-juno : f5e33fc79a3f77b0013c005019b72430d8998e8b</li>
<li>commit_eclipse-poky-kepler : 4c6d3defe86648c0321f832820b9cbc9ddf68742</li>
<li>commit_eclipse-poky-luna : fbabac5425731644a9cae4126771525c16a943f7</li>
<li>commit_meta-fsl-arm : 6002fa0777327a4ca6ee5c0ec36fa1ce8d74087e</li>
<li>commit_meta-fsl-ppc : bf49a8acbbedbac89b0a39381447a5cb4b3a3450</li>
<li>commit_meta-intel : 4739f47e9358ec8cb82a72f3e185003c5ce40b2c</li>
<li>commit_meta-minnow : 13a5f2ab84c7284647a3e067a33109c11dae0568</li>
<li>commit_meta-qt3 : 3016129d90b7ac8517a5227d819f10ad417b5b45</li>
<li>commit_oecore : 7ffe10df73cc20d10fcd41b121074445273bd60e</li>
<li>commit_poky : 1426e31f0bcd19f066931d2ecbdec3752b14e88e</li>
<li>commit_resolvedhead_bitbake : 3e12f4e8e3ec66d1df772a64be04b90ec72462ae</li>
<li>commit_resolvedhead_eclipse-poky-juno : f5e33fc79a3f77b0013c005019b72430d8998e8b</li>
<li>commit_resolvedhead_eclipse-poky-kepler : 4c6d3defe86648c0321f832820b9cbc9ddf68742</li>
<li>commit_resolvedhead_eclipse-poky-luna : fbabac5425731644a9cae4126771525c16a943f7</li>
<li>commit_resolvedhead_meta-fsl-arm : 6002fa0777327a4ca6ee5c0ec36fa1ce8d74087e</li>
<li>commit_resolvedhead_meta-fsl-ppc : bf49a8acbbedbac89b0a39381447a5cb4b3a3450</li>
<li>commit_resolvedhead_meta-intel : 4739f47e9358ec8cb82a72f3e185003c5ce40b2c</li>
<li>commit_resolvedhead_meta-minnow : 13a5f2ab84c7284647a3e067a33109c11dae0568</li>
<li>commit_resolvedhead_meta-qt3 : 3016129d90b7ac8517a5227d819f10ad417b5b45</li>
<li>commit_resolvedhead_oecore : 7ffe10df73cc20d10fcd41b121074445273bd60e</li>
<li>commit_resolvedhead_poky : 1426e31f0bcd19f066931d2ecbdec3752b14e88e</li>
<li>distroversion : 1.8+snapshot</li>
<li>got_revision : 1426e31f0bcd19f066931d2ecbdec3752b14e88e</li>
<li>got_revision_meta-qt3 : 3016129d90b7ac8517a5227d819f10ad417b5b45</li>
<li>got_revision_poky : 1426e31f0bcd19f066931d2ecbdec3752b14e88e</li>
<li>layerversion_core : 5</li>
<li>layerversion_yoctobsp : 3</li>
<li>repo_bitbake : git://git.openembedded.org/bitbake</li>
<li>repo_eclipse-poky-juno : git://git.yoctoproject.org/eclipse-poky</li>
<li>repo_eclipse-poky-kepler : git://git.yoctoproject.org/eclipse-poky</li>
<li>repo_eclipse-poky-luna : git://git.yoctoproject.org/eclipse-poky</li>
<li>repo_meta-fsl-arm : git://git.yoctoproject.org/meta-fsl-arm</li>
<li>repo_meta-fsl-ppc : git://git.yoctoproject.org/meta-fsl-ppc</li>
<li>repo_meta-intel : git://git.yoctoproject.org/meta-intel</li>
<li>repo_meta-minnow : git://git.yoctoproject.org/meta-minnow</li>
<li>repo_meta-qt3 : git://git.yoctoproject.org/meta-qt3</li>
<li>repo_oecore : git://git.openembedded.org/openembedded-core</li>
<li>repo_poky : git://git.yoctoproject.org/poky</li>
<li>repository : git://git.yoctoproject.org/poky</li>
<li>repourl_meta-qt3 : git://git.yoctoproject.org/meta-qt3</li>
<li>repourl_poky : git://git.yoctoproject.org/poky</li>
<li>revision : 1426e31f0bcd19f066931d2ecbdec3752b14e88e</li>
<li>scheduler : trigger_main-build</li>
<li>slavename : centos7-a.osl.yoctoproject.org</li>
<li>workdir : /home/pokybuild/yocto-autobuilder/yocto-worker/nightly-deb</li>
</ul>
<i>Detailed log of last build step:</i> <a href="http://autobuilder.yoctoproject.org/main/builders/nightly-deb/builds/285/steps/BuildImages/logs/stdio">http://autobuilder.yoctoproject.org/main/builders/nightly-deb/builds/285/steps/BuildImages/logs/stdio</a>
<br>
<h4>Last 60 lines of "BuildImages.stdio" Error log:</h4>
<p>
ERROR: QA Issue: gcc: Files/directories were installed but not shipped in any package:<br>Summary: There was 1 ERROR message shown, returning a non-zero exit code.
</p>
<i>Detailed log of last build step:</i> <a href="http://autobuilder.yoctoproject.org/main/builders/nightly-deb/builds/285/steps/Running Sanity Tests_1/logs/stdio">http://autobuilder.yoctoproject.org/main/builders/nightly-deb/builds/285/steps/Running Sanity Tests_1/logs/stdio</a>
<br>
<h4>Last 60 lines of "Running Sanity Tests_1.stdio" Error log:</h4>
<p>
| If this is not intended, touch /tmp/qemu-tap-locks/tap4.skip to make runqemu skip tap4.<br>| Running qemu-system-i386...<br>| /home/pokybuild/yocto-autobuilder/yocto-worker/nightly-deb/build/build/tmp/sysroots/x86_64-linux/usr/bin/qemu-system-i386 -kernel /home/pokybuild/yocto-autobuilder/yocto-worker/nightly-deb/build/build/tmp/deploy/images/qemux86/bzImage-qemux86.bin -net nic,vlan=0 -net tap,vlan=0,ifname=tap4,script=no,downscript=no -cpu qemu32 -hda /home/pokybuild/yocto-autobuilder/yocto-worker/nightly-deb/build/build/tmp/work/qemux86-poky-linux/core-image-sato/1.0-r0/testimage/core-image-sato-qemux86-testimage.ext4 -show-cursor -usb -usbdevice wacom-tablet -vga vmware -no-reboot -serial tcp:127.0.0.1:55353 -m 256 --append "vga=0 uvesafb.mode_option=640x480-32 root=/dev/hda rw mem=256M ip=192.168.7.10::192.168.7.9:255.255.255.0 oprofile.timer=1 rootfstype=ext4 console=tty1 console=ttyS0,115200n8"<br>| WARNING: Image format was not specified for '/home/pokybuild/yocto-autobuild
 er/yocto-worker/nightly-deb/build/build/tmp/work/qemux86-poky-linux/core-image-sato/1.0-r0/testimage/core-image-sato-qemux86-testimage.ext4' and probing guessed raw.<br>|          Automatically detecting the format is dangerous for raw images, write operations on block 0 will be restricted.<br>|          Specify the 'raw' format explicitly to remove the restrictions.<br>| /home/pokybuild/yocto-autobuilder/yocto-worker/nightly-deb/build/scripts/runqemu-internal: line 688: 14958 Segmentation fault      LD_PRELOAD="$GL_LD_PRELOAD" $QEMUBIN -kernel $KERNEL $QEMUOPTIONS $SERIALOPTS -no-reboot $SCRIPT_QEMU_OPT $SCRIPT_QEMU_EXTRA_OPT --append "$KERNCMDLINE $SCRIPT_KERNEL_OPT"<br>| Releasing lockfile of preconfigured tap device 'tap4'<br>| stty: standard input: Inappropriate ioctl for device<br>| stty: standard input: Inappropriate ioctl for device<br>| <br>| DEBUG: Python function do_testimage finished<br>| ERROR: Function failed: core-image-sato - FAILED to start qemu - check the task log
  and the boot log<br>ERROR: Task 0 (/home/pokybuild/yocto-autobuilder/yocto-worker/nightly-deb/build/meta/recipes-sato/images/core-image-sato.bb, do_testimage) failed with exit code '1'<br>Summary: There was 1 ERROR message shown, returning a non-zero exit code.
</p>
<i>Detailed log of last build step:</i> <a href="http://autobuilder.yoctoproject.org/main/builders/nightly-deb/builds/285/steps/Running Sanity Tests_2/logs/stdio">http://autobuilder.yoctoproject.org/main/builders/nightly-deb/builds/285/steps/Running Sanity Tests_2/logs/stdio</a>
<br>
<h4>Last 60 lines of "Running Sanity Tests_2.stdio" Error log:</h4>
<p>
| NOTE: Created listening socket for qemu serial console on: 127.0.0.1:38919<br>| NOTE: rootfs file: /home/pokybuild/yocto-autobuilder/yocto-worker/nightly-deb/build/build/tmp/work/qemux86-poky-linux/core-image-sato-sdk/1.0-r0/testimage/core-image-sato-sdk-qemux86-testimage.ext4<br>| NOTE: Qemu log file: /home/pokybuild/yocto-autobuilder/yocto-worker/nightly-deb/build/build/tmp/work/qemux86-poky-linux/core-image-sato-sdk/1.0-r0/testimage/qemu_boot_log.20150510164555<br>| NOTE: SSH log file: /home/pokybuild/yocto-autobuilder/yocto-worker/nightly-deb/build/build/tmp/work/qemux86-poky-linux/core-image-sato-sdk/1.0-r0/testimage/ssh_target_log.20150510164555<br>| NOTE: runqemu started, pid is 15335<br>| NOTE: waiting at most 60 seconds for qemu pid<br>| NOTE: qemu started - qemu procces pid is 15481<br>| NOTE: Target IP: 192.168.7.4<br>| NOTE: Server IP: 192.168.7.3<br>| NOTE: Waiting at most 1500 seconds for login banner<br>| NOTE: Connection from 127.0.0.1:54027<br>| NOTE: Reached login
  banner<br>| NOTE: Test modules  ['oeqa.runtime.ping', 'oeqa.runtime.ssh', 'oeqa.runtime.df', 'oeqa.runtime.connman', 'oeqa.runtime.syslog', 'oeqa.runtime.xorg', 'oeqa.runtime.scp', 'oeqa.runtime.vnc', 'oeqa.runtime.date', 'oeqa.runtime.perl', 'oeqa.runtime.ldd', 'oeqa.runtime.gcc', 'oeqa.runtime.kernelmodule', 'oeqa.runtime.dmesg', 'oeqa.runtime.python']<br>| NOTE: Found 27 tests<br>| test_ping (oeqa.runtime.ping.PingTest) ... ok<br>| test_ssh (oeqa.runtime.ssh.SshTest) ... ok<br>| test_df (oeqa.runtime.df.DfTest) ... ok<br>| test_scp_file (oeqa.runtime.scp.ScpTest) ... ok<br>| test_vnc (oeqa.runtime.vnc.VNCTest) ... ok<br>| test_date (oeqa.runtime.date.DateTest) ... ok<br>| test_perl_exists (oeqa.runtime.perl.PerlTest) ... ok<br>| test_perl_works (oeqa.runtime.perl.PerlTest) ... ok<br>| test_ldd_exists (oeqa.runtime.ldd.LddTest) ... ok<br>| test_ldd_rtldlist_check (oeqa.runtime.ldd.LddTest) ... ok<br>| test_gcc_compile (oeqa.runtime.gcc.GccCompileTest) ... ok<br>| test_gpp2_compil
 e (oeqa.runtime.gcc.GccCompileTest) ... FAIL<br>| test_gpp_compile (oeqa.runtime.gcc.GccCompileTest) ... ok<br>| test_make (oeqa.runtime.gcc.GccCompileTest) ... ok<br>| test_kernel_module (oeqa.runtime.kernelmodule.KernelModuleTest) ... ok<br>| test_dmesg (oeqa.runtime.dmesg.DmesgTest) ... ok<br>| test_python_exists (oeqa.runtime.python.PythonTest) ... ok<br>| test_python_stdout (oeqa.runtime.python.PythonTest) ... ok<br>| test_python_testfile (oeqa.runtime.python.PythonTest) ... ok<br>| test_connmand_help (oeqa.runtime.connman.ConnmanTest) ... ok<br>| test_connmand_running (oeqa.runtime.connman.ConnmanTest) ... ok<br>| test_syslog_help (oeqa.runtime.syslog.SyslogTest) ... ok<br>| test_syslog_running (oeqa.runtime.syslog.SyslogTest) ... ok<br>| test_syslog_logger (oeqa.runtime.syslog.SyslogTestConfig) ... ok<br>| test_syslog_restart (oeqa.runtime.syslog.SyslogTestConfig) ... ok<br>| test_syslog_startup_config (oeqa.runtime.syslog.SyslogTestConfig) ... ok<br>| test_xorg_running (oeqa
 .runtime.xorg.XorgTest) ... ok<br>| <br>| ======================================================================<br>| FAIL: test_gpp2_compile (oeqa.runtime.gcc.GccCompileTest)<br>| ----------------------------------------------------------------------<br>| Traceback (most recent call last):<br>|   File "/home/pokybuild/yocto-autobuilder/yocto-worker/nightly-deb/build/meta/lib/oeqa/runtime/gcc.py", line 35, in test_gpp2_compile<br>|     self.assertEqual(status, 0, msg="g++ compile failed, output: %s" % output)<br>| AssertionError: 1 != 0 : g++ compile failed, output: /tmp/test.cpp:1:18: fatal error: limits: No such file or directory<br>| compilation terminated.<br>| <br>| ----------------------------------------------------------------------<br>| Ran 27 tests in 134.723s<br>| <br>| FAILED (failures=1)<br>| NOTE: Sending SIGTERM to runqemu<br>| DEBUG: Python function do_testimage finished<br>| ERROR: Function failed: core-image-sato-sdk - FAILED - check the task log and the ssh log<br
 >ERROR: Task 0 (/home/pokybuild/yocto-autobuilder/yocto-worker/nightly-deb/build/meta/recipes-sato/images/core-image-sato-sdk.bb, do_testimage) failed with exit code '1'<br>Summary: There was 1 ERROR message shown, returning a non-zero exit code.
</p>
<br><br>
<b>-The Yocto BuildBot</b>