<h4>Build status: FAILURE</h4>
Build worker for this Build: <b>centos7-a.osl.yoctoproject.org</b>
<br>
Complete logs for all build steps: <a href="http://autobuilder.yoctoproject.org/main/builders/nightly-x86/builds/295">http://autobuilder.yoctoproject.org/main/builders/nightly-x86/builds/295</a>
<br>
Build Reason: Triggerable(trigger_main-build)
<br>
Build Properties:<br>
<ul>
<li>Contents of bblayers.conf (Note. LCONF_VERSION will not show up correctly)<br><code>
LCONF_VERSION = <LCONF> <br>
BBPATH = "${TOPDIR}" <br>
BBFILES ?="" <br>
BBLAYERS += " \ <br>
/home/pokybuild/yocto-autobuilder/yocto-worker/nightly-x86/build/meta \ <br>
/home/pokybuild/yocto-autobuilder/yocto-worker/nightly-x86/build/meta-yocto \ <br>
/home/pokybuild/yocto-autobuilder/yocto-worker/nightly-x86/build/meta-yocto-bsp \ <br>
/home/pokybuild/yocto-autobuilder/yocto-worker/nightly-x86/build/meta-qt3 \ <br>
" <br>
<br></code></li>
<li>DEST : /srv/www/vhosts/autobuilder.yoctoproject.org/pub/nightly/20150510-2</li>
<li>DISTRO : poky</li>
<li>Contents of auto.conf (local.conf for autobuilders)<br><code>
INHERIT += "toaster"<br>
INHERIT += "report-error"<br>
DISTRO = "poky"<br>
PACKAGE_CLASSES = "package_rpm package_deb package_ipk"<br>
BB_NUMBER_THREADS = "16"<br>
PARALLEL_MAKE = "-j 16"<br>
SDKMACHINE ?= "x86_64"<br>
BB_TASK_NICE_LEVEL = "5"<br>
IMAGE_FSTYPES_append = " tar.gz"<br>
BB_TASK_NICE_LEVEL_task-testimage = "0"<br>
DL_DIR = "/srv/www/vhosts/autobuilder.yoctoproject.org/current_sources"<br>
SSTATE_DIR ?= "/srv/www/vhosts/autobuilder.yoctoproject.org/pub/sstate/" <br>
MACHINE = "qemux86"<br>
PREMIRRORS = ""<br>
BB_GENERATE_MIRROR_TARBALLS = "1"<br>
ADTREPO = "http://adtrepo.yoctoproject.org//1.8+snapshot"<br>
<br></code></li>
<li>MACHINE : qemux86</li>
<li>bitbakeversion : 1.27.0</li>
<li>branch : master-next</li>
<li>branch_bitbake : master</li>
<li>branch_eclipse-poky-juno : juno-master</li>
<li>branch_eclipse-poky-kepler : kepler-master</li>
<li>branch_eclipse-poky-luna : luna-master</li>
<li>branch_meta-fsl-arm : master</li>
<li>branch_meta-fsl-ppc : master</li>
<li>branch_meta-intel : master</li>
<li>branch_meta-minnow : master</li>
<li>branch_meta-qt3 : master</li>
<li>branch_oecore : master</li>
<li>branch_poky : master-next</li>
<li>builddir : /home/pokybuild/yocto-autobuilder/yocto-worker/nightly-x86</li>
<li>buildername : nightly-x86</li>
<li>buildnumber : 295</li>
<li>commit-description : fido-13.0.0</li>
<li>commit_bitbake : 3e12f4e8e3ec66d1df772a64be04b90ec72462ae</li>
<li>commit_eclipse-poky-juno : f5e33fc79a3f77b0013c005019b72430d8998e8b</li>
<li>commit_eclipse-poky-kepler : 4c6d3defe86648c0321f832820b9cbc9ddf68742</li>
<li>commit_eclipse-poky-luna : fbabac5425731644a9cae4126771525c16a943f7</li>
<li>commit_meta-fsl-arm : 6002fa0777327a4ca6ee5c0ec36fa1ce8d74087e</li>
<li>commit_meta-fsl-ppc : bf49a8acbbedbac89b0a39381447a5cb4b3a3450</li>
<li>commit_meta-intel : 4739f47e9358ec8cb82a72f3e185003c5ce40b2c</li>
<li>commit_meta-minnow : 13a5f2ab84c7284647a3e067a33109c11dae0568</li>
<li>commit_meta-qt3 : 3016129d90b7ac8517a5227d819f10ad417b5b45</li>
<li>commit_oecore : 7ffe10df73cc20d10fcd41b121074445273bd60e</li>
<li>commit_poky : 1426e31f0bcd19f066931d2ecbdec3752b14e88e</li>
<li>commit_resolvedhead_bitbake : 3e12f4e8e3ec66d1df772a64be04b90ec72462ae</li>
<li>commit_resolvedhead_eclipse-poky-juno : f5e33fc79a3f77b0013c005019b72430d8998e8b</li>
<li>commit_resolvedhead_eclipse-poky-kepler : 4c6d3defe86648c0321f832820b9cbc9ddf68742</li>
<li>commit_resolvedhead_eclipse-poky-luna : fbabac5425731644a9cae4126771525c16a943f7</li>
<li>commit_resolvedhead_meta-fsl-arm : 6002fa0777327a4ca6ee5c0ec36fa1ce8d74087e</li>
<li>commit_resolvedhead_meta-fsl-ppc : bf49a8acbbedbac89b0a39381447a5cb4b3a3450</li>
<li>commit_resolvedhead_meta-intel : 4739f47e9358ec8cb82a72f3e185003c5ce40b2c</li>
<li>commit_resolvedhead_meta-minnow : 13a5f2ab84c7284647a3e067a33109c11dae0568</li>
<li>commit_resolvedhead_meta-qt3 : 3016129d90b7ac8517a5227d819f10ad417b5b45</li>
<li>commit_resolvedhead_oecore : 7ffe10df73cc20d10fcd41b121074445273bd60e</li>
<li>commit_resolvedhead_poky : 1426e31f0bcd19f066931d2ecbdec3752b14e88e</li>
<li>distroversion : 1.8+snapshot</li>
<li>got_revision : 1426e31f0bcd19f066931d2ecbdec3752b14e88e</li>
<li>got_revision_meta-qt3 : 3016129d90b7ac8517a5227d819f10ad417b5b45</li>
<li>got_revision_poky : 1426e31f0bcd19f066931d2ecbdec3752b14e88e</li>
<li>layerversion_core : 5</li>
<li>layerversion_yoctobsp : 3</li>
<li>repo_bitbake : git://git.openembedded.org/bitbake</li>
<li>repo_eclipse-poky-juno : git://git.yoctoproject.org/eclipse-poky</li>
<li>repo_eclipse-poky-kepler : git://git.yoctoproject.org/eclipse-poky</li>
<li>repo_eclipse-poky-luna : git://git.yoctoproject.org/eclipse-poky</li>
<li>repo_meta-fsl-arm : git://git.yoctoproject.org/meta-fsl-arm</li>
<li>repo_meta-fsl-ppc : git://git.yoctoproject.org/meta-fsl-ppc</li>
<li>repo_meta-intel : git://git.yoctoproject.org/meta-intel</li>
<li>repo_meta-minnow : git://git.yoctoproject.org/meta-minnow</li>
<li>repo_meta-qt3 : git://git.yoctoproject.org/meta-qt3</li>
<li>repo_oecore : git://git.openembedded.org/openembedded-core</li>
<li>repo_poky : git://git.yoctoproject.org/poky</li>
<li>repository : git://git.yoctoproject.org/poky</li>
<li>repourl_meta-qt3 : git://git.yoctoproject.org/meta-qt3</li>
<li>repourl_poky : git://git.yoctoproject.org/poky</li>
<li>revision : 1426e31f0bcd19f066931d2ecbdec3752b14e88e</li>
<li>scheduler : trigger_main-build</li>
<li>slavename : centos7-a.osl.yoctoproject.org</li>
<li>workdir : /home/pokybuild/yocto-autobuilder/yocto-worker/nightly-x86</li>
</ul>
<i>Detailed log of last build step:</i> <a href="http://autobuilder.yoctoproject.org/main/builders/nightly-x86/builds/295/steps/BuildImages/logs/stdio">http://autobuilder.yoctoproject.org/main/builders/nightly-x86/builds/295/steps/BuildImages/logs/stdio</a>
<br>
<h4>Last 60 lines of "BuildImages.stdio" Error log:</h4>
<p>
ERROR: QA Issue: gcc: Files/directories were installed but not shipped in any package:<br>Summary: There was 1 ERROR message shown, returning a non-zero exit code.
</p>
<i>Detailed log of last build step:</i> <a href="http://autobuilder.yoctoproject.org/main/builders/nightly-x86/builds/295/steps/Running Sanity Tests/logs/stdio">http://autobuilder.yoctoproject.org/main/builders/nightly-x86/builds/295/steps/Running Sanity Tests/logs/stdio</a>
<br>
<h4>Last 60 lines of "Running Sanity Tests.stdio" Error log:</h4>
<p>
| test_smart_search (oeqa.runtime.smart.SmartBasicTest) ... ok<br>| test_smart_stats (oeqa.runtime.smart.SmartBasicTest) ... ok<br>| test_smart_version (oeqa.runtime.smart.SmartBasicTest) ... ok<br>| test_smart_add_rpmdir (oeqa.runtime.smart.SmartRepoTest) ... ok<br>| test_smart_channel (oeqa.runtime.smart.SmartRepoTest) ... ok<br>| test_smart_channel_add (oeqa.runtime.smart.SmartRepoTest) ... ok<br>| test_smart_channel_help (oeqa.runtime.smart.SmartRepoTest) ... ok<br>| test_smart_channel_list (oeqa.runtime.smart.SmartRepoTest) ... ok<br>| test_smart_channel_rpmsys (oeqa.runtime.smart.SmartRepoTest) ... ok<br>| test_smart_channel_show (oeqa.runtime.smart.SmartRepoTest) ... ok<br>| test_smart_install (oeqa.runtime.smart.SmartRepoTest) ... ok<br>| test_smart_install_dependency (oeqa.runtime.smart.SmartRepoTest) ... ok<br>| test_smart_install_from_disk (oeqa.runtime.smart.SmartRepoTest) ... ok<br>| test_smart_install_from_http (oeqa.runtime.smart.SmartRepoTest) ... ok<br>| test_smart_l
 ocal_dir (oeqa.runtime.smart.SmartRepoTest) ... ok<br>| test_smart_reinstall (oeqa.runtime.smart.SmartRepoTest) ... ok<br>| test_smart_remote_repo (oeqa.runtime.smart.SmartRepoTest) ... ok<br>| test_smart_remove_package (oeqa.runtime.smart.SmartRepoTest) ... ok<br>| test_kernel_module (oeqa.runtime.kernelmodule.KernelModuleTest) ... ok<br>| test_dmesg (oeqa.runtime.dmesg.DmesgTest) ... ok<br>| test_python_exists (oeqa.runtime.python.PythonTest) ... ok<br>| test_python_stdout (oeqa.runtime.python.PythonTest) ... ok<br>| test_python_testfile (oeqa.runtime.python.PythonTest) ... ok<br>| test_parselogs (oeqa.runtime.parselogs.ParseLogsTest) ... ok<br>| test_connmand_help (oeqa.runtime.connman.ConnmanTest) ... ok<br>| test_connmand_running (oeqa.runtime.connman.ConnmanTest) ... ok<br>| test_syslog_help (oeqa.runtime.syslog.SyslogTest) ... ok<br>| test_syslog_running (oeqa.runtime.syslog.SyslogTest) ... ok<br>| test_syslog_logger (oeqa.runtime.syslog.SyslogTestConfig) ... ok<br>| test_sys
 log_restart (oeqa.runtime.syslog.SyslogTestConfig) ... ok<br>| test_syslog_startup_config (oeqa.runtime.syslog.SyslogTestConfig) ... ok<br>| test_xorg_running (oeqa.runtime.xorg.XorgTest) ... ok<br>| <br>| ======================================================================<br>| FAIL: test_gpp2_compile (oeqa.runtime.gcc.GccCompileTest)<br>| ----------------------------------------------------------------------<br>| Traceback (most recent call last):<br>|   File "/home/pokybuild/yocto-autobuilder/yocto-worker/nightly-x86/build/meta/lib/oeqa/runtime/gcc.py", line 35, in test_gpp2_compile<br>|     self.assertEqual(status, 0, msg="g++ compile failed, output: %s" % output)<br>| AssertionError: 1 != 0 : g++ compile failed, output: /tmp/test.cpp:1:18: fatal error: limits: No such file or directory<br>| compilation terminated.<br>| <br>| ----------------------------------------------------------------------<br>| Ran 54 tests in 1207.578s<br>| <br>| FAILED (failures=1)<br>| NOTE: Sending S
 IGTERM to runqemu<br>| DEBUG: Python function do_testimage finished<br>| ERROR: Function failed: core-image-sato-sdk - FAILED - check the task log and the ssh log<br>| Machine information:<br>| *******************************<br>| Machine name: qemux86<br>| CPU:  QEMU Virtual CPU version 2.3.0<br>| Arch: i686<br>| Physical cores: 1<br>| Logical cores: 1<br>| *******************************<br>| <br>ERROR: Task 2 (/home/pokybuild/yocto-autobuilder/yocto-worker/nightly-x86/build/meta/recipes-sato/images/core-image-sato-sdk.bb, do_testimage) failed with exit code '1'<br>Summary: There was 1 ERROR message shown, returning a non-zero exit code.
</p>
<i>Detailed log of last build step:</i> <a href="http://autobuilder.yoctoproject.org/main/builders/nightly-x86/builds/295/steps/BuildImages_1/logs/stdio">http://autobuilder.yoctoproject.org/main/builders/nightly-x86/builds/295/steps/BuildImages_1/logs/stdio</a>
<br>
<h4>Last 60 lines of "BuildImages_1.stdio" Error log:</h4>
<p>
ERROR: Task 144 (/home/pokybuild/yocto-autobuilder/yocto-worker/nightly-x86/build/meta/recipes-kernel/linux/linux-yocto_3.14.bb, do_compile) failed with exit code '1'<br>ERROR: QA Issue: gcc: Files/directories were installed but not shipped in any package:<br>Summary: There were 2 ERROR messages shown, returning a non-zero exit code.
</p>
<i>Detailed log of last build step:</i> <a href="http://autobuilder.yoctoproject.org/main/builders/nightly-x86/builds/295/steps/Building Toolchain Images/logs/stdio">http://autobuilder.yoctoproject.org/main/builders/nightly-x86/builds/295/steps/Building Toolchain Images/logs/stdio</a>
<br>
<h4>Last 60 lines of "Building Toolchain Images.stdio" Error log:</h4>
<p>
ERROR: QA Issue: gcc-cross-canadian-i586: Files/directories were installed but not shipped in any package:<br>Summary: There was 1 ERROR message shown, returning a non-zero exit code.
</p>
<i>Detailed log of last build step:</i> <a href="http://autobuilder.yoctoproject.org/main/builders/nightly-x86/builds/295/steps/Building Toolchain Images_1/logs/stdio">http://autobuilder.yoctoproject.org/main/builders/nightly-x86/builds/295/steps/Building Toolchain Images_1/logs/stdio</a>
<br>
<h4>Last 60 lines of "Building Toolchain Images_1.stdio" Error log:</h4>
<p>
ERROR: QA Issue: gcc-cross-canadian-i586: Files/directories were installed but not shipped in any package:<br>Summary: There was 1 ERROR message shown, returning a non-zero exit code.
</p>
<br><br>
<b>-The Yocto BuildBot</b>