<h4>Build status: FAILURE</h4>
Build worker for this Build: <b>ubuntu1204.osl.yoctoproject.org</b>
<br>
Complete logs for all build steps: <a href="http://autobuilder.yoctoproject.org/main/builders/nightly-x86-64/builds/265">http://autobuilder.yoctoproject.org/main/builders/nightly-x86-64/builds/265</a>
<br>
Build Reason: Triggerable(trigger_main-build)
<br>
Build Properties:<br>
<ul>
<li>Contents of bblayers.conf (Note. LCONF_VERSION will not show up correctly)<br><code>
LCONF_VERSION = <LCONF> <br>
BBPATH = "${TOPDIR}" <br>
BBFILES ?="" <br>
BBLAYERS += " \ <br>
/home/pokybuild/yocto-autobuilder/yocto-worker/nightly-x86-64/build/meta \ <br>
/home/pokybuild/yocto-autobuilder/yocto-worker/nightly-x86-64/build/meta-yocto \ <br>
/home/pokybuild/yocto-autobuilder/yocto-worker/nightly-x86-64/build/meta-yocto-bsp \ <br>
/home/pokybuild/yocto-autobuilder/yocto-worker/nightly-x86-64/build/meta-qt3 \ <br>
" <br>
<br></code></li>
<li>DEST : /srv/www/vhosts/autobuilder.yoctoproject.org/pub/nightly/20150415-2</li>
<li>Contents of auto.conf (local.conf for autobuilders)<br><code>
INHERIT += "report-error"<br>
DISTRO = "poky"<br>
PACKAGE_CLASSES = "package_rpm package_deb package_ipk"<br>
BB_NUMBER_THREADS = "16"<br>
PARALLEL_MAKE = "-j 16"<br>
SDKMACHINE ?= "x86_64"<br>
BB_TASK_NICE_LEVEL = "5"<br>
IMAGE_FSTYPES_append = " tar.gz"<br>
BB_TASK_NICE_LEVEL_task-testimage = "0"<br>
DL_DIR = "/srv/www/vhosts/autobuilder.yoctoproject.org/current_sources"<br>
SSTATE_DIR ?= "/srv/www/vhosts/autobuilder.yoctoproject.org/pub/sstate/" <br>
MACHINE = "qemux86-64"<br>
PREMIRRORS = ""<br>
BB_GENERATE_MIRROR_TARBALLS = "1"<br>
ADTREPO = "http://adtrepo.yoctoproject.org//1.8+snapshot"<br>
<br></code></li>
<li>MACHINE : qemux86-64</li>
<li>branch : master-next</li>
<li>branch_bitbake : master</li>
<li>branch_eclipse-poky-juno : juno-master</li>
<li>branch_eclipse-poky-kepler : kepler-master</li>
<li>branch_eclipse-poky-luna : luna-master</li>
<li>branch_meta-fsl-arm : master</li>
<li>branch_meta-fsl-ppc : master</li>
<li>branch_meta-intel : master</li>
<li>branch_meta-minnow : master</li>
<li>branch_meta-qt3 : master</li>
<li>branch_oecore : master</li>
<li>branch_poky : master-next</li>
<li>builddir : /home/pokybuild/yocto-autobuilder/yocto-worker/nightly-x86-64</li>
<li>buildername : nightly-x86-64</li>
<li>buildnumber : 265</li>
<li>commit-description : 1.7_M3</li>
<li>commit_bitbake : c4172fe33f0c63eda7f4af2bd36a5e9738e13595</li>
<li>commit_eclipse-poky-juno : f5e33fc79a3f77b0013c005019b72430d8998e8b</li>
<li>commit_eclipse-poky-kepler : 92f81a5b75ef184a88ba3aded5941dafced0e4cc</li>
<li>commit_eclipse-poky-luna : 7c7292f5cb2893be4d0313b471e45f989b41ea44</li>
<li>commit_meta-fsl-arm : e3cc9452aaa2895bbc8bdd7c8940b4dd2d14213e</li>
<li>commit_meta-fsl-ppc : 4c8cd553f9de56379e2b6502ceb996521e2d6a20</li>
<li>commit_meta-intel : 53eea4f12311b4808b3af9695ac822eea1fc60c2</li>
<li>commit_meta-minnow : 13a5f2ab84c7284647a3e067a33109c11dae0568</li>
<li>commit_meta-qt3 : 3016129d90b7ac8517a5227d819f10ad417b5b45</li>
<li>commit_oecore : cfc43743b0e41cf168cad9cbd4e9d870b8f01f03</li>
<li>commit_poky : 90b8d406488b0a3c42b2a745526e5b1273d8a982</li>
<li>commit_resolvedhead_bitbake : c4172fe33f0c63eda7f4af2bd36a5e9738e13595</li>
<li>commit_resolvedhead_eclipse-poky-juno : f5e33fc79a3f77b0013c005019b72430d8998e8b</li>
<li>commit_resolvedhead_eclipse-poky-kepler : 92f81a5b75ef184a88ba3aded5941dafced0e4cc</li>
<li>commit_resolvedhead_eclipse-poky-luna : 7c7292f5cb2893be4d0313b471e45f989b41ea44</li>
<li>commit_resolvedhead_meta-fsl-arm : e3cc9452aaa2895bbc8bdd7c8940b4dd2d14213e</li>
<li>commit_resolvedhead_meta-fsl-ppc : 4c8cd553f9de56379e2b6502ceb996521e2d6a20</li>
<li>commit_resolvedhead_meta-intel : 53eea4f12311b4808b3af9695ac822eea1fc60c2</li>
<li>commit_resolvedhead_meta-minnow : 13a5f2ab84c7284647a3e067a33109c11dae0568</li>
<li>commit_resolvedhead_meta-qt3 : 3016129d90b7ac8517a5227d819f10ad417b5b45</li>
<li>commit_resolvedhead_oecore : cfc43743b0e41cf168cad9cbd4e9d870b8f01f03</li>
<li>commit_resolvedhead_poky : 90b8d406488b0a3c42b2a745526e5b1273d8a982</li>
<li>distroversion : 1.8+snapshot</li>
<li>got_revision : 90b8d406488b0a3c42b2a745526e5b1273d8a982</li>
<li>got_revision_meta-qt3 : 3016129d90b7ac8517a5227d819f10ad417b5b45</li>
<li>got_revision_poky : 90b8d406488b0a3c42b2a745526e5b1273d8a982</li>
<li>layerversion_core : 5</li>
<li>layerversion_yoctobsp : 3</li>
<li>repo_bitbake : git://git.openembedded.org/bitbake</li>
<li>repo_eclipse-poky-juno : git://git.yoctoproject.org/eclipse-poky</li>
<li>repo_eclipse-poky-kepler : git://git.yoctoproject.org/eclipse-poky</li>
<li>repo_eclipse-poky-luna : git://git.yoctoproject.org/eclipse-poky</li>
<li>repo_meta-fsl-arm : git://git.yoctoproject.org/meta-fsl-arm</li>
<li>repo_meta-fsl-ppc : git://git.yoctoproject.org/meta-fsl-ppc</li>
<li>repo_meta-intel : git://git.yoctoproject.org/meta-intel</li>
<li>repo_meta-minnow : git://git.yoctoproject.org/meta-minnow</li>
<li>repo_meta-qt3 : git://git.yoctoproject.org/meta-qt3</li>
<li>repo_oecore : git://git.openembedded.org/openembedded-core</li>
<li>repo_poky : git://git.yoctoproject.org/poky</li>
<li>repository : git://git.yoctoproject.org/poky</li>
<li>repourl_meta-qt3 : git://git.yoctoproject.org/meta-qt3</li>
<li>repourl_poky : git://git.yoctoproject.org/poky</li>
<li>revision : 90b8d406488b0a3c42b2a745526e5b1273d8a982</li>
<li>scheduler : trigger_main-build</li>
<li>slavename : ubuntu1204.osl.yoctoproject.org</li>
<li>workdir : /home/pokybuild/yocto-autobuilder/yocto-worker/nightly-x86-64</li>
</ul>
<i>Detailed log of last build step:</i> <a href="http://autobuilder.yoctoproject.org/main/builders/nightly-x86-64/builds/265/steps/Running Sanity Tests/logs/stdio">http://autobuilder.yoctoproject.org/main/builders/nightly-x86-64/builds/265/steps/Running Sanity Tests/logs/stdio</a>
<br>
<h4>Last 60 lines of "Running Sanity Tests.stdio" Error log:</h4>
<p>
| test_connmand_help (oeqa.runtime.connman.ConnmanTest) ... ok<br>| test_connmand_running (oeqa.runtime.connman.ConnmanTest) ... ok<br>| test_syslog_help (oeqa.runtime.syslog.SyslogTest) ... ok<br>| test_syslog_running (oeqa.runtime.syslog.SyslogTest) ... ok<br>| test_syslog_logger (oeqa.runtime.syslog.SyslogTestConfig) ... ok<br>| test_syslog_restart (oeqa.runtime.syslog.SyslogTestConfig) ... ok<br>| test_syslog_startup_config (oeqa.runtime.syslog.SyslogTestConfig) ... ok<br>| test_xorg_running (oeqa.runtime.xorg.XorgTest) ... ok<br>| <br>| ======================================================================<br>| FAIL: test_kernel_module (oeqa.runtime.kernelmodule.KernelModuleTest)<br>| ----------------------------------------------------------------------<br>| Traceback (most recent call last):<br>|   File "/home/pokybuild/yocto-autobuilder/yocto-worker/nightly-x86-64/build/meta/lib/oeqa/utils/decorators.py", line 98, in wrapped_f<br>|     return func(*args)<br>|   File "/home/po
 kybuild/yocto-autobuilder/yocto-worker/nightly-x86-64/build/meta/lib/oeqa/utils/decorators.py", line 86, in wrapped_f<br>|     return f(*args)<br>|   File "/home/pokybuild/yocto-autobuilder/yocto-worker/nightly-x86-64/build/meta/lib/oeqa/utils/decorators.py", line 86, in wrapped_f<br>|     return f(*args)<br>|   File "/home/pokybuild/yocto-autobuilder/yocto-worker/nightly-x86-64/build/meta/lib/oeqa/runtime/kernelmodule.py", line 31, in test_kernel_module<br>|     self.assertEqual(status, 0, msg="\n".join([cmd, output]))<br>| AssertionError: 2 != 0 : cd /usr/src/kernel && make scripts<br>|   HOSTCC  scripts/basic/fixdep<br>|   HOSTCC  scripts/kconfig/conf.o<br>|   SHIPPED scripts/kconfig/zconf.tab.c<br>|   SHIPPED scripts/kconfig/zconf.lex.c<br>|   SHIPPED scripts/kconfig/zconf.hash.c<br>|   HOSTCC  scripts/kconfig/zconf.tab.o<br>|   HOSTLD  scripts/kconfig/conf<br>| scripts/kconfig/conf --silentoldconfig Kconfig<br>| ***<br>| *** Configuration file ".config" not found!<br>| ***<br>|
  *** Please run some configurator (e.g. "make oldconfig" or<br>| *** "make menuconfig" or "make xconfig").<br>| ***<br>| scripts/kconfig/Makefile:36: recipe for target 'silentoldconfig' failed<br>| make[2]: *** [silentoldconfig] Error 1<br>| Makefile:543: recipe for target 'silentoldconfig' failed<br>| make[1]: *** [silentoldconfig] Error 2<br>| make: *** No rule to make target 'include/config/auto.conf', needed by 'scripts'.  Stop.<br>| <br>| ----------------------------------------------------------------------<br>| Ran 54 tests in 1281.829s<br>| <br>| FAILED (failures=1)<br>| NOTE: Sending SIGTERM to runqemu<br>| DEBUG: Python function do_testimage finished<br>| ERROR: Function failed: core-image-sato-sdk - FAILED - check the task log and the ssh log<br>| Machine information:<br>| *******************************<br>| Machine name: qemux86-64<br>| CPU:  Intel(R) Core(TM)2 Duo CPU     T7700  @ 2.40GHz<br>| Arch: x86_64<br>| Physical cores: 1<br>| Logical cores: 1<br>| *************
 ******************<br>| <br>ERROR: Task 2 (/home/pokybuild/yocto-autobuilder/yocto-worker/nightly-x86-64/build/meta/recipes-sato/images/core-image-sato-sdk.bb, do_testimage) failed with exit code '1'<br>Summary: There was 1 ERROR message shown, returning a non-zero exit code.
</p>
<br><br>
<b>-The Yocto BuildBot</b>