<h4>Build status: FAILURE</h4>
Build worker for this Build: <b>fedora21.osl.yoctoproject.org</b>
<br>
Complete logs for all build steps: <a href="http://autobuilder.yoctoproject.org/main/builders/nightly-x86-64/builds/112">http://autobuilder.yoctoproject.org/main/builders/nightly-x86-64/builds/112</a>
<br>
Build Reason: Triggerable(trigger_main-build)
<br>
Build Properties:<br>
<ul>
<li>Contents of bblayers.conf (Note. LCONF_VERSION will not show up correctly)<br><code>
LCONF_VERSION = <LCONF> <br>
BBPATH = "${TOPDIR}" <br>
BBFILES ?="" <br>
BBLAYERS += " \ <br>
/home/pokybuild/yocto-autobuilder/yocto-worker/nightly-x86-64/build/meta \ <br>
/home/pokybuild/yocto-autobuilder/yocto-worker/nightly-x86-64/build/meta-yocto \ <br>
/home/pokybuild/yocto-autobuilder/yocto-worker/nightly-x86-64/build/meta-yocto-bsp \ <br>
/home/pokybuild/yocto-autobuilder/yocto-worker/nightly-x86-64/build/meta-qt3 \ <br>
" <br>
<br></code></li>
<li>DEST : /srv/www/vhosts/autobuilder.yoctoproject.org/pub/nightly/20141126-1</li>
<li>Contents of auto.conf (local.conf for autobuilders)<br><code>
INHERIT += "report-error"<br>
DISTRO = "poky"<br>
PACKAGE_CLASSES = "package_rpm package_deb package_ipk"<br>
BB_NUMBER_THREADS = "16"<br>
PARALLEL_MAKE = "-j 16"<br>
SDKMACHINE ?= "x86_64"<br>
BB_TASK_NICE_LEVEL = "5"<br>
IMAGE_FSTYPES_append = " tar.gz"<br>
BB_TASK_NICE_LEVEL_task-testimage = "0"<br>
DL_DIR = "/srv/www/vhosts/autobuilder.yoctoproject.org/current_sources"<br>
SSTATE_DIR ?= "/srv/www/vhosts/autobuilder.yoctoproject.org/pub/sstate/" <br>
MACHINE = "qemux86-64"<br>
PREMIRRORS = ""<br>
BB_GENERATE_MIRROR_TARBALLS = "1"<br>
ADTREPO = "http://adtrepo.yoctoproject.org//1.7"<br>
<br></code></li>
<li>MACHINE : qemux86-64</li>
<li>branch : master</li>
<li>branch_bitbake : master</li>
<li>branch_eclipse-poky-juno : master</li>
<li>branch_eclipse-poky-kepler : master</li>
<li>branch_meta-fsl-arm : master</li>
<li>branch_meta-fsl-ppc : master</li>
<li>branch_meta-intel : master</li>
<li>branch_meta-minnow : master</li>
<li>branch_meta-qt3 : master</li>
<li>branch_oecore : master</li>
<li>branch_poky : master</li>
<li>builddir : /home/pokybuild/yocto-autobuilder/yocto-worker/nightly-x86-64</li>
<li>buildername : nightly-x86-64</li>
<li>buildnumber : 112</li>
<li>commit-description : dizzy-12.0.0</li>
<li>commit_bitbake : 27023ce2d264ce05008ef9af33982b054c6a87b5</li>
<li>commit_eclipse-poky-juno : 26bfc407781aa185f244a47ba63120343cee4a37</li>
<li>commit_eclipse-poky-kepler : 4a167fd662262ebdaa3cf0d332ac0debb52d7904</li>
<li>commit_meta-fsl-arm : 5593081ccc97633c1b2b7d12b1827a20498e7f0e</li>
<li>commit_meta-fsl-ppc : deb326df1489d4844f911605a2627f95c89b167f</li>
<li>commit_meta-intel : 18c63a66ac50d67d27e58caa8e8ef48ceb81cd93</li>
<li>commit_meta-minnow : 13a5f2ab84c7284647a3e067a33109c11dae0568</li>
<li>commit_meta-qt3 : 3016129d90b7ac8517a5227d819f10ad417b5b45</li>
<li>commit_oecore : ff2ff155ea5273b2023a1c9834b13f10249d343f</li>
<li>commit_poky : 0bc03af7ee6112fa0af0608b02f715ec8495e4ff</li>
<li>commit_resolvedhead_bitbake : 27023ce2d264ce05008ef9af33982b054c6a87b5</li>
<li>commit_resolvedhead_eclipse-poky-juno : 26bfc407781aa185f244a47ba63120343cee4a37</li>
<li>commit_resolvedhead_eclipse-poky-kepler : 4a167fd662262ebdaa3cf0d332ac0debb52d7904</li>
<li>commit_resolvedhead_meta-fsl-arm : 5593081ccc97633c1b2b7d12b1827a20498e7f0e</li>
<li>commit_resolvedhead_meta-fsl-ppc : deb326df1489d4844f911605a2627f95c89b167f</li>
<li>commit_resolvedhead_meta-intel : 18c63a66ac50d67d27e58caa8e8ef48ceb81cd93</li>
<li>commit_resolvedhead_meta-minnow : 13a5f2ab84c7284647a3e067a33109c11dae0568</li>
<li>commit_resolvedhead_meta-qt3 : 3016129d90b7ac8517a5227d819f10ad417b5b45</li>
<li>commit_resolvedhead_oecore : ff2ff155ea5273b2023a1c9834b13f10249d343f</li>
<li>commit_resolvedhead_poky : 0bc03af7ee6112fa0af0608b02f715ec8495e4ff</li>
<li>distroversion : 1.7</li>
<li>got_revision : 0bc03af7ee6112fa0af0608b02f715ec8495e4ff</li>
<li>got_revision_meta-qt3 : 3016129d90b7ac8517a5227d819f10ad417b5b45</li>
<li>got_revision_poky : 0bc03af7ee6112fa0af0608b02f715ec8495e4ff</li>
<li>layerversion_core : 4</li>
<li>layerversion_yoctobsp : 3</li>
<li>repo_bitbake : git://git.openembedded.org/bitbake</li>
<li>repo_eclipse-poky-juno : git://git.yoctoproject.org/eclipse-poky-juno</li>
<li>repo_eclipse-poky-kepler : git://git.yoctoproject.org/eclipse-poky-kepler</li>
<li>repo_meta-fsl-arm : git://git.yoctoproject.org/meta-fsl-arm</li>
<li>repo_meta-fsl-ppc : git://git.yoctoproject.org/meta-fsl-ppc</li>
<li>repo_meta-intel : git://git.yoctoproject.org/meta-intel</li>
<li>repo_meta-minnow : git://git.yoctoproject.org/meta-minnow</li>
<li>repo_meta-qt3 : git://git.yoctoproject.org/meta-qt3</li>
<li>repo_oecore : git://git.openembedded.org/openembedded-core</li>
<li>repo_poky : git://git.yoctoproject.org/poky</li>
<li>repository : git://git.yoctoproject.org/poky</li>
<li>repourl_meta-qt3 : git://git.yoctoproject.org/meta-qt3</li>
<li>repourl_poky : git://git.yoctoproject.org/poky</li>
<li>revision : 0bc03af7ee6112fa0af0608b02f715ec8495e4ff</li>
<li>scheduler : trigger_main-build</li>
<li>slavename : fedora21.osl.yoctoproject.org</li>
<li>workdir : /home/pokybuild/yocto-autobuilder/yocto-worker/nightly-x86-64</li>
</ul>
<i>Detailed log of last build step:</i> <a href="http://autobuilder.yoctoproject.org/main/builders/nightly-x86-64/builds/112/steps/Running Sanity Tests/logs/stdio">http://autobuilder.yoctoproject.org/main/builders/nightly-x86-64/builds/112/steps/Running Sanity Tests/logs/stdio</a>
<br>
<h4>Last 60 lines of "Running Sanity Tests.stdio" Error log:</h4>
<p>
| ERROR: test_parselogs (oeqa.runtime.parselogs.ParseLogsTest)<br>| ----------------------------------------------------------------------<br>| Traceback (most recent call last):<br>|   File "/home/pokybuild/yocto-autobuilder/yocto-worker/nightly-x86-64/build/meta/lib/oeqa/utils/decorators.py", line 74, in wrapped_f<br>|     res = getResults()<br>|   File "/home/pokybuild/yocto-autobuilder/yocto-worker/nightly-x86-64/build/meta/lib/oeqa/utils/decorators.py", line 22, in __init__<br>|     self.errorlist = [ seq[0]._testMethodName for seq in upperf.f_locals['result'].errors ]<br>| AttributeError: '_ErrorHolder' object has no attribute '_testMethodName'<br>| <br>| ======================================================================<br>| FAIL: test_ping (oeqa.runtime.ping.PingTest)<br>| ----------------------------------------------------------------------<br>| Traceback (most recent call last):<br>|   File "/home/pokybuild/yocto-autobuilder/yocto-worker/nightly-x86-64/build/meta/lib/o
 eqa/runtime/ping.py", line 20, in test_ping<br>|     self.assertEqual(count, 5, msg = "Expected 5 consecutive replies, got %d.\nping output is:\n%s" % (count,output))<br>| AssertionError: 0 != 5 : Expected 5 consecutive replies, got 0.<br>| ping output is:<br>| PING 192.168.7.6 (192.168.7.6) 56(84) bytes of data.<br>| <br>| --- 192.168.7.6 ping statistics ---<br>| 1 packets transmitted, 0 received, 100% packet loss, time 0ms<br>| <br>| PING 192.168.7.6 (192.168.7.6) 56(84) bytes of data.<br>| <br>| --- 192.168.7.6 ping statistics ---<br>| 1 packets transmitted, 0 received, 100% packet loss, time 0ms<br>| <br>| PING 192.168.7.6 (192.168.7.6) 56(84) bytes of data.<br>| <br>| --- 192.168.7.6 ping statistics ---<br>| 1 packets transmitted, 0 received, 100% packet loss, time 0ms<br>| <br>| PING 192.168.7.6 (192.168.7.6) 56(84) bytes of data.<br>| <br>| --- 192.168.7.6 ping statistics ---<br>| 1 packets transmitted, 0 received, 100% packet loss, time 0ms<br>| <br>| PING 192.168.7.6 (192.1
 68.7.6) 56(84) bytes of data.<br>| <br>| --- 192.168.7.6 ping statistics ---<br>| 1 packets transmitted, 0 received, 100% packet loss, time 0ms<br>| <br>| PING 192.168.7.6 (192.168.7.6) 56(84) bytes of data.<br>| <br>| --- 192.168.7.6 ping statistics ---<br>| 1 packets transmitted, 0 received, 100% packet loss, time 0ms<br>| <br>| <br>| <br>| ----------------------------------------------------------------------<br>| Ran 27 tests in 696.358s<br>| <br>| FAILED (failures=1, errors=18, skipped=13)<br>| NOTE: Sending SIGTERM to runqemu<br>| DEBUG: Python function do_testimage finished<br>| ERROR: Function failed: core-image-sato-sdk - FAILED - check the task log and the ssh log<br>| Test modules  ['oeqa.runtime.ping', 'oeqa.runtime.ssh', 'oeqa.runtime.df', 'oeqa.runtime.connman', 'oeqa.runtime.syslog', 'oeqa.runtime.xorg', 'oeqa.runtime.scp', 'oeqa.runtime.vnc', 'oeqa.runtime.date', 'oeqa.runtime.perl', 'oeqa.runtime.ldd', 'oeqa.runtime.gcc', 'oeqa.runtime.rpm', 'oeqa.runtime.smart', 'o
 eqa.runtime.kernelmodule', 'oeqa.runtime.dmesg', 'oeqa.runtime.python', 'oeqa.runtime.parselogs']<br>| Found 49 tests<br>ERROR: Task 2 (/home/pokybuild/yocto-autobuilder/yocto-worker/nightly-x86-64/build/meta/recipes-sato/images/core-image-sato-sdk.bb, do_testimage) failed with exit code '1'<br>Summary: There were 3 ERROR messages shown, returning a non-zero exit code.
</p>
<br><br>
<b>-The Yocto BuildBot</b>