<h4>Build status: FAILURE</h4>
Build worker for this Build: <b>ubuntu1204.osl.yoctoproject.org</b>
<br>
Complete logs for all build steps: <a href="http://autobuilder.yoctoproject.org/main/builders/nightly-qa-systemd/builds/95">http://autobuilder.yoctoproject.org/main/builders/nightly-qa-systemd/builds/95</a>
<br>
Build Reason: Triggerable(trigger_main-build_nowait)
<br>
Build Properties:<br>
<ul>
<li>Contents of bblayers.conf (Note. LCONF_VERSION will not show up correctly)<br><code>
LCONF_VERSION = <LCONF> <br>
BBPATH = "${TOPDIR}" <br>
BBFILES ?="" <br>
BBLAYERS += " \ <br>
/home/pokybuild/yocto-autobuilder/yocto-worker/nightly-qa-systemd/build/meta \ <br>
/home/pokybuild/yocto-autobuilder/yocto-worker/nightly-qa-systemd/build/meta-yocto \ <br>
/home/pokybuild/yocto-autobuilder/yocto-worker/nightly-qa-systemd/build/meta-yocto-bsp \ <br>
" <br>
<br></code></li>
<li>DEST : /srv/www/vhosts/autobuilder.yoctoproject.org/pub/nightly/20141108-3</li>
<li>Contents of auto.conf (local.conf for autobuilders)<br><code>
INHERIT += "report-error"<br>
DISTRO = "poky"<br>
PACKAGE_CLASSES = "package_rpm package_deb package_ipk"<br>
BB_NUMBER_THREADS = "16"<br>
PARALLEL_MAKE = "-j 16"<br>
SDKMACHINE ?= "i686"<br>
BB_TASK_NICE_LEVEL = "5"<br>
IMAGE_FSTYPES_append = " tar.gz"<br>
BB_TASK_NICE_LEVEL_task-testimage = "0"<br>
DL_DIR = "/srv/www/vhosts/autobuilder.yoctoproject.org/current_sources"<br>
SSTATE_DIR ?= "/srv/www/vhosts/autobuilder.yoctoproject.org/pub/sstate/" <br>
MACHINE = "qemux86-64"<br>
PREMIRRORS = ""<br>
BB_GENERATE_MIRROR_TARBALLS = "1"<br>
ADTREPO = "http://adtrepo.yoctoproject.org//1.7"<br>
DISTRO_FEATURES_append = " systemd"<br>
VIRTUAL-RUNTIME_init_manager = "systemd"<br>
DISTRO_FEATURES_BACKFILL_CONSIDERED = "sysvinit"<br>
<br></code></li>
<li>MACHINE : qemux86-64</li>
<li>branch : master-next</li>
<li>branch_bitbake : master</li>
<li>branch_eclipse-poky-juno : master</li>
<li>branch_eclipse-poky-kepler : master</li>
<li>branch_meta-fsl-arm : master</li>
<li>branch_meta-fsl-ppc : master</li>
<li>branch_meta-intel : master</li>
<li>branch_meta-minnow : master</li>
<li>branch_meta-qt3 : master</li>
<li>branch_oecore : master</li>
<li>branch_poky : master-next</li>
<li>builddir : /home/pokybuild/yocto-autobuilder/yocto-worker/nightly-qa-systemd</li>
<li>buildername : nightly-qa-systemd</li>
<li>buildnumber : 95</li>
<li>commit-description : 1.7_M2-1163-g30a410b</li>
<li>commit_bitbake : 9f171ea755644ecd9d2b3d7ed13bf8ec09ec917a</li>
<li>commit_eclipse-poky-juno : 26bfc407781aa185f244a47ba63120343cee4a37</li>
<li>commit_eclipse-poky-kepler : 4a167fd662262ebdaa3cf0d332ac0debb52d7904</li>
<li>commit_meta-fsl-arm : 7ba68fb3b0ec93014dfa9a02f56caf2916ccbe05</li>
<li>commit_meta-fsl-ppc : deb326df1489d4844f911605a2627f95c89b167f</li>
<li>commit_meta-intel : 0f6d30a95c84ec239f5a30bbfba17ed42e2cf284</li>
<li>commit_meta-minnow : 13a5f2ab84c7284647a3e067a33109c11dae0568</li>
<li>commit_meta-qt3 : 3016129d90b7ac8517a5227d819f10ad417b5b45</li>
<li>commit_oecore : d301ef7c2a5e857bd87be2a24251243ff181fa24</li>
<li>commit_poky : 30a410b0f35480f4895b7dc7ac9985d6214bab77</li>
<li>commit_resolvedhead_bitbake : 9f171ea755644ecd9d2b3d7ed13bf8ec09ec917a</li>
<li>commit_resolvedhead_eclipse-poky-juno : 26bfc407781aa185f244a47ba63120343cee4a37</li>
<li>commit_resolvedhead_eclipse-poky-kepler : 4a167fd662262ebdaa3cf0d332ac0debb52d7904</li>
<li>commit_resolvedhead_meta-fsl-arm : 7ba68fb3b0ec93014dfa9a02f56caf2916ccbe05</li>
<li>commit_resolvedhead_meta-fsl-ppc : deb326df1489d4844f911605a2627f95c89b167f</li>
<li>commit_resolvedhead_meta-intel : 0f6d30a95c84ec239f5a30bbfba17ed42e2cf284</li>
<li>commit_resolvedhead_meta-minnow : 13a5f2ab84c7284647a3e067a33109c11dae0568</li>
<li>commit_resolvedhead_meta-qt3 : 3016129d90b7ac8517a5227d819f10ad417b5b45</li>
<li>commit_resolvedhead_oecore : d301ef7c2a5e857bd87be2a24251243ff181fa24</li>
<li>commit_resolvedhead_poky : 30a410b0f35480f4895b7dc7ac9985d6214bab77</li>
<li>distroversion : 1.7</li>
<li>got_revision : 30a410b0f35480f4895b7dc7ac9985d6214bab77</li>
<li>got_revision_poky : 30a410b0f35480f4895b7dc7ac9985d6214bab77</li>
<li>layerversion_core : 4</li>
<li>layerversion_yoctobsp : 3</li>
<li>repo_bitbake : git://git.openembedded.org/bitbake</li>
<li>repo_eclipse-poky-juno : git://git.yoctoproject.org/eclipse-poky-juno</li>
<li>repo_eclipse-poky-kepler : git://git.yoctoproject.org/eclipse-poky-kepler</li>
<li>repo_meta-fsl-arm : git://git.yoctoproject.org/meta-fsl-arm</li>
<li>repo_meta-fsl-ppc : git://git.yoctoproject.org/meta-fsl-ppc</li>
<li>repo_meta-intel : git://git.yoctoproject.org/meta-intel</li>
<li>repo_meta-minnow : git://git.yoctoproject.org/meta-minnow</li>
<li>repo_meta-qt3 : git://git.yoctoproject.org/meta-qt3</li>
<li>repo_oecore : git://git.openembedded.org/openembedded-core</li>
<li>repo_poky : git://git.yoctoproject.org/poky</li>
<li>repository : git://git.yoctoproject.org/poky</li>
<li>repourl_poky : git://git.yoctoproject.org/poky</li>
<li>revision : 30a410b0f35480f4895b7dc7ac9985d6214bab77</li>
<li>scheduler : trigger_main-build_nowait</li>
<li>slavename : ubuntu1204.osl.yoctoproject.org</li>
<li>workdir : /home/pokybuild/yocto-autobuilder/yocto-worker/nightly-qa-systemd</li>
</ul>
<i>Detailed log of last build step:</i> <a href="http://autobuilder.yoctoproject.org/main/builders/nightly-qa-systemd/builds/95/steps/Running Sanity Tests_2/logs/stdio">http://autobuilder.yoctoproject.org/main/builders/nightly-qa-systemd/builds/95/steps/Running Sanity Tests_2/logs/stdio</a>
<br>
<h4>Last 60 lines of "Running Sanity Tests_2.stdio" Error log:</h4>
<p>
|    37 root         0 SW   [kworker/0:2]<br>|    38 root         0 SW<  [dm_bufio_cache]<br>|    41 root         0 SW<  [ipv6_addrconf]<br>|    42 root         0 SW<  [bioset]<br>|    43 root         0 SW<  [deferwq]<br>|    44 root         0 SW   [kjournald]<br>|    67 root         0 SW   [kworker/u2:2]<br>|    73 root      4576 S    /sbin/v86d<br>|    99 root     32204 S    /lib/systemd/systemd-udevd<br>|   114 avahi    25920 S    avahi-daemon: running [qemux86-64.local]<br>|   116 root      7776 S    /sbin/klogd -n<br>|   117 distcc   17556 S N  /usr/bin/distccd --verbose --no-detach --daemon --al<br>|   120 root     21988 S    /usr/sbin/ofonod -n<br>|   121 messageb 13292 S    /usr/bin/dbus-daemon --system --address=systemd: --n<br>|   122 avahi    25796 S    avahi-daemon: chroot helper<br>|   139 distcc   17556 S N  /usr/bin/distccd --verbose --no-detach --daemon --al<br>|   143 distcc   17556 S N  /usr/bin/distccd --verbose --no-detach --daemon --al<br>|   160 distcc   17556 S
  N  /usr/bin/distccd --verbose --no-detach --daemon --al<br>|   169 root     15180 S    /lib/systemd/systemd-logind<br>|   183 root         0 SW   [kworker/0:3]<br>|   184 root     33684 S    /usr/sbin/connmand -n<br>|   300 root     38592 S    /usr/sbin/wpa_supplicant -u<br>|   305 root      8432 S    /sbin/agetty -8 --keep-baud ttyS0 115200 xterm<br>|   308 root      8432 S    /sbin/agetty --noclear tty1 linux<br>|   334 root     19116 S    /lib/systemd/systemd-journald<br>|   403 root      7840 S    /sbin/syslogd -n -C<br>|   415 root     15132 S    /usr/sbin/dropbear -i -r /etc/dropbear/dropbear_rsa_<br>|   416 root      9376 S    sh -c  . /etc/profile; ps<br>|   417 root     12004 R    ps<br>| <br>| ======================================================================<br>| FAIL: test_vnc (oeqa.runtime.vnc.VNCTest)<br>| ----------------------------------------------------------------------<br>| Traceback (most recent call last):<br>|   File "/home/pokybuild/yocto-autobuilder/yo
 cto-worker/nightly-qa-systemd/build/meta/lib/oeqa/utils/decorators.py", line 90, in wrapped_f<br>|     return func(*args)<br>|   File "/home/pokybuild/yocto-autobuilder/yocto-worker/nightly-qa-systemd/build/meta/lib/oeqa/utils/decorators.py", line 79, in wrapped_f<br>|     return f(*args)<br>|   File "/home/pokybuild/yocto-autobuilder/yocto-worker/nightly-qa-systemd/build/meta/lib/oeqa/runtime/vnc.py", line 14, in test_vnc<br>|     self.assertEqual(status, 0, msg="x11vnc server failed to start: %s" % output)<br>| AssertionError: 1 != 0 : x11vnc server failed to start:<br>| <br>| ----------------------------------------------------------------------<br>| Ran 46 tests in 1000.808s<br>| <br>| FAILED (failures=2, skipped=1)<br>| NOTE: Sending SIGTERM to runqemu<br>| DEBUG: Python function do_testimage finished<br>| ERROR: Function failed: core-image-sato - FAILED - check the task log and the ssh log<br>| Machine information:<br>| *******************************<br>| Machine name: qemux8
 6-64<br>| CPU:  Intel(R) Core(TM)2 Duo CPU     T7700  @ 2.40GHz<br>| Arch: x86_64<br>| Physical cores: 1<br>| Logical cores: 1<br>| *******************************<br>| <br>ERROR: Task 0 (/home/pokybuild/yocto-autobuilder/yocto-worker/nightly-qa-systemd/build/meta/recipes-sato/images/core-image-sato.bb, do_testimage) failed with exit code '1'<br>Summary: There was 1 ERROR message shown, returning a non-zero exit code.
</p>
<br><br>
<b>-The Yocto BuildBot</b>