<h4>Build status: FAILURE</h4>
Build worker for this Build: <b>centos7-a.osl.yoctoproject.org</b>
<br>
Complete logs for all build steps: <a href="http://autobuilder.yoctoproject.org/main/builders/nightly-multilib/builds/95">http://autobuilder.yoctoproject.org/main/builders/nightly-multilib/builds/95</a>
<br>
Build Reason: Triggerable(trigger_main-build)
<br>
Build Properties:<br>
<ul>
<li>Contents of bblayers.conf (Note. LCONF_VERSION will not show up correctly)<br><code>
LCONF_VERSION = <LCONF> <br>
BBPATH = "${TOPDIR}" <br>
BBFILES ?="" <br>
BBLAYERS += " \ <br>
/home/pokybuild/yocto-autobuilder/yocto-worker/nightly-multilib/build/meta \ <br>
/home/pokybuild/yocto-autobuilder/yocto-worker/nightly-multilib/build/meta-yocto \ <br>
/home/pokybuild/yocto-autobuilder/yocto-worker/nightly-multilib/build/meta-yocto-bsp \ <br>
/home/pokybuild/yocto-autobuilder/yocto-worker/nightly-multilib/build/meta-qt3 \ <br>
" <br>
<br></code></li>
<li>DEST : /srv/www/vhosts/autobuilder.yoctoproject.org/pub/nightly/20141108-2</li>
<li>Contents of auto.conf (local.conf for autobuilders)<br><code>
INHERIT += "report-error"<br>
DISTRO = "poky"<br>
PACKAGE_CLASSES = "package_rpm package_deb package_ipk"<br>
BB_NUMBER_THREADS = "16"<br>
PARALLEL_MAKE = "-j 16"<br>
SDKMACHINE ?= "i686"<br>
BB_TASK_NICE_LEVEL = "5"<br>
IMAGE_FSTYPES_append = " tar.gz"<br>
BB_TASK_NICE_LEVEL_task-testimage = "0"<br>
DL_DIR = "/srv/www/vhosts/autobuilder.yoctoproject.org/current_sources"<br>
require conf/multilib.conf <br>
MULTILIBS = "multilib:lib64" <br>
DEFAULTTUNE_virtclass-multilib-lib64 = "x86-64" <br>
SSTATE_DIR ?= "/srv/www/vhosts/autobuilder.yoctoproject.org/pub/sstate/multilib" <br>
MACHINE = "qemux86"<br>
PREMIRRORS = ""<br>
BB_GENERATE_MIRROR_TARBALLS = "1"<br>
ADTREPO = "http://adtrepo.yoctoproject.org//1.7"<br>
<br></code></li>
<li>MACHINE : qemux86</li>
<li>branch : master-next</li>
<li>branch_bitbake : master</li>
<li>branch_eclipse-poky-juno : master</li>
<li>branch_eclipse-poky-kepler : master</li>
<li>branch_meta-fsl-arm : master</li>
<li>branch_meta-fsl-ppc : master</li>
<li>branch_meta-intel : master</li>
<li>branch_meta-minnow : master</li>
<li>branch_meta-qt3 : master</li>
<li>branch_oecore : master</li>
<li>branch_poky : master-next</li>
<li>builddir : /home/pokybuild/yocto-autobuilder/yocto-worker/nightly-multilib</li>
<li>buildername : nightly-multilib</li>
<li>buildnumber : 95</li>
<li>commit-description : dizzy-12.0.0</li>
<li>commit_bitbake : 9f171ea755644ecd9d2b3d7ed13bf8ec09ec917a</li>
<li>commit_eclipse-poky-juno : 26bfc407781aa185f244a47ba63120343cee4a37</li>
<li>commit_eclipse-poky-kepler : 4a167fd662262ebdaa3cf0d332ac0debb52d7904</li>
<li>commit_meta-fsl-arm : a60fe9e69b01cac92825808b02eaaf186a086819</li>
<li>commit_meta-fsl-ppc : deb326df1489d4844f911605a2627f95c89b167f</li>
<li>commit_meta-intel : 0f6d30a95c84ec239f5a30bbfba17ed42e2cf284</li>
<li>commit_meta-minnow : 13a5f2ab84c7284647a3e067a33109c11dae0568</li>
<li>commit_meta-qt3 : 3016129d90b7ac8517a5227d819f10ad417b5b45</li>
<li>commit_oecore : d301ef7c2a5e857bd87be2a24251243ff181fa24</li>
<li>commit_poky : 0927bfc89cc32a0a7b08e6f2b3e43122396414d9</li>
<li>commit_resolvedhead_bitbake : 9f171ea755644ecd9d2b3d7ed13bf8ec09ec917a</li>
<li>commit_resolvedhead_eclipse-poky-juno : 26bfc407781aa185f244a47ba63120343cee4a37</li>
<li>commit_resolvedhead_eclipse-poky-kepler : 4a167fd662262ebdaa3cf0d332ac0debb52d7904</li>
<li>commit_resolvedhead_meta-fsl-arm : a60fe9e69b01cac92825808b02eaaf186a086819</li>
<li>commit_resolvedhead_meta-fsl-ppc : deb326df1489d4844f911605a2627f95c89b167f</li>
<li>commit_resolvedhead_meta-intel : 0f6d30a95c84ec239f5a30bbfba17ed42e2cf284</li>
<li>commit_resolvedhead_meta-minnow : 13a5f2ab84c7284647a3e067a33109c11dae0568</li>
<li>commit_resolvedhead_meta-qt3 : 3016129d90b7ac8517a5227d819f10ad417b5b45</li>
<li>commit_resolvedhead_oecore : d301ef7c2a5e857bd87be2a24251243ff181fa24</li>
<li>commit_resolvedhead_poky : 0927bfc89cc32a0a7b08e6f2b3e43122396414d9</li>
<li>distroversion : 1.7</li>
<li>got_revision : 0927bfc89cc32a0a7b08e6f2b3e43122396414d9</li>
<li>got_revision_meta-qt3 : 3016129d90b7ac8517a5227d819f10ad417b5b45</li>
<li>got_revision_poky : 0927bfc89cc32a0a7b08e6f2b3e43122396414d9</li>
<li>layerversion_core : 4</li>
<li>layerversion_yoctobsp : 3</li>
<li>repo_bitbake : git://git.openembedded.org/bitbake</li>
<li>repo_eclipse-poky-juno : git://git.yoctoproject.org/eclipse-poky-juno</li>
<li>repo_eclipse-poky-kepler : git://git.yoctoproject.org/eclipse-poky-kepler</li>
<li>repo_meta-fsl-arm : git://git.yoctoproject.org/meta-fsl-arm</li>
<li>repo_meta-fsl-ppc : git://git.yoctoproject.org/meta-fsl-ppc</li>
<li>repo_meta-intel : git://git.yoctoproject.org/meta-intel</li>
<li>repo_meta-minnow : git://git.yoctoproject.org/meta-minnow</li>
<li>repo_meta-qt3 : git://git.yoctoproject.org/meta-qt3</li>
<li>repo_oecore : git://git.openembedded.org/openembedded-core</li>
<li>repo_poky : git://git.yoctoproject.org/poky</li>
<li>repository : git://git.yoctoproject.org/poky</li>
<li>repourl_meta-qt3 : git://git.yoctoproject.org/meta-qt3</li>
<li>repourl_poky : git://git.yoctoproject.org/poky</li>
<li>revision : 0927bfc89cc32a0a7b08e6f2b3e43122396414d9</li>
<li>scheduler : trigger_main-build</li>
<li>slavename : centos7-a.osl.yoctoproject.org</li>
<li>workdir : /home/pokybuild/yocto-autobuilder/yocto-worker/nightly-multilib</li>
</ul>
<i>Detailed log of last build step:</i> <a href="http://autobuilder.yoctoproject.org/main/builders/nightly-multilib/builds/95/steps/Running Sanity Tests_2/logs/stdio">http://autobuilder.yoctoproject.org/main/builders/nightly-multilib/builds/95/steps/Running Sanity Tests_2/logs/stdio</a>
<br>
<h4>Last 60 lines of "Running Sanity Tests_2.stdio" Error log:</h4>
<p>
| test_python_exists (oeqa.runtime.python.PythonTest) ... ok<br>| test_python_stdout (oeqa.runtime.python.PythonTest) ... ok<br>| test_python_testfile (oeqa.runtime.python.PythonTest) ... ok<br>| test_parselogs (oeqa.runtime.parselogs.ParseLogsTest) ... FAIL<br>| test_file_connman (oeqa.runtime.multilib.MultilibTest) ... ok<br>| <br>| ======================================================================<br>| FAIL: test_parselogs (oeqa.runtime.parselogs.ParseLogsTest)<br>| ----------------------------------------------------------------------<br>| Traceback (most recent call last):<br>|   File "/home/pokybuild/yocto-autobuilder/yocto-worker/nightly-multilib/build/meta/lib/oeqa/utils/decorators.py", line 79, in wrapped_f<br>|     return f(*args)<br>|   File "/home/pokybuild/yocto-autobuilder/yocto-worker/nightly-multilib/build/meta/lib/oeqa/runtime/parselogs.py", line 178, in test_parselogs<br>|     self.assertEqual(errcount, 0, msg=self.msg)<br>| AssertionError: 1 != 0 : Log: /var/lo
 g//Xorg.0.log<br>| -----------------------<br>| Central error: [2417579.188] (EE) systemd-logind: failed to get session: The name org.freedesktop.login1 was not provided by any .service files<br>| ***********************<br>| [2417579.098]        Entry deleted from font path.<br>| [2417579.099] (==) FontPath set to:<br>| <br>| [2417579.099] (==) ModulePath set to "/usr/lib64/xorg/modules"<br>| [2417579.099] (II) Loader magic: 0x7f0f40<br>| [2417579.099] (II) Module ABI versions:<br>| [2417579.113]   X.Org ANSI C Emulation: 0.4<br>| [2417579.113]    X.Org Video Driver: 18.0<br>| [2417579.113]       X.Org XInput driver : 21.0<br>| [2417579.113]     X.Org Server Extension : 8.0<br>| [2417579.188] (EE) systemd-logind: failed to get session: The name org.freedesktop.login1 was not provided by any .service files<br>| [2417579.224] (--) PCI:*(0:0:2:0) 15ad:0405:15ad:0405 rev 0, Mem @ 0xfd000000/16777216, 0xfe000000/65536, I/O @ 0x0000c070/16, BIOS @ 0x????????/65536<br>| [2417579.228] (WW) Open ACPI failed
  (/var/run/acpid.socket) (No such file or directory)<br>| [2417579.238] (II) LoadModule: "glx"<br>| [2417579.265] (WW) Warning, couldn't open module glx<br>| [2417579.265] (II) UnloadModule: "glx"<br>| [2417579.268] (II) Unloading glx<br>| [2417579.268] (EE) Failed to load module "glx" (module does not exist, 0)<br>| [2417579.275] (==) Matched vmware as autoconfigured driver 0<br>| [2417579.275] (==) Matched modesetting as autoconfigured driver 1<br>| [2417579.275] (==) Matched fbdev as autoconfigured driver 2<br>| ***********************<br>| 1 errors found in logs.<br>| <br>| ----------------------------------------------------------------------<br>| Ran 41 tests in 524.423s<br>| <br>| FAILED (failures=1)<br>| NOTE: Sending SIGTERM to runqemu<br>| DEBUG: Python function do_testimage finished<br>| ERROR: Function failed: core-image-sato - FAILED - check the task log and the ssh log<br>| Machine information:<br>| *******************************<br>| Machine name: qemux86-64<br>| CPU
 :  Intel(R) Core(TM)2 Duo CPU     T7700  @ 2.40GHz<br>| Arch: x86_64<br>| Physical cores: 1<br>| Logical cores: 1<br>| *******************************<br>| <br>ERROR: Task 0 (/home/pokybuild/yocto-autobuilder/yocto-worker/nightly-multilib/build/meta/recipes-sato/images/core-image-sato.bb, do_testimage) failed with exit code '1'<br>Summary: There was 1 ERROR message shown, returning a non-zero exit code.
</p>
<i>Detailed log of last build step:</i> <a href="http://autobuilder.yoctoproject.org/main/builders/nightly-multilib/builds/95/steps/Running Sanity Tests_3/logs/stdio">http://autobuilder.yoctoproject.org/main/builders/nightly-multilib/builds/95/steps/Running Sanity Tests_3/logs/stdio</a>
<br>
<h4>Last 60 lines of "Running Sanity Tests_3.stdio" Error log:</h4>
<p>
| skipped "systemd: target doesn't have systemd in DISTRO_FEATURES"<br>| test_vnc (oeqa.runtime.vnc.VNCTest) ... ok<br>| skipped 'x32lib: DEFAULTTUNE is not set to x86-64-x32'<br>| <br>| ======================================================================<br>| FAIL: test_parselogs (oeqa.runtime.parselogs.ParseLogsTest)<br>| ----------------------------------------------------------------------<br>| Traceback (most recent call last):<br>|   File "/home/pokybuild/yocto-autobuilder/yocto-worker/nightly-multilib/build/meta/lib/oeqa/utils/decorators.py", line 79, in wrapped_f<br>|     return f(*args)<br>|   File "/home/pokybuild/yocto-autobuilder/yocto-worker/nightly-multilib/build/meta/lib/oeqa/runtime/parselogs.py", line 178, in test_parselogs<br>|     self.assertEqual(errcount, 0, msg=self.msg)<br>| AssertionError: 1 != 0 : Log: /var/log//Xorg.0.log<br>| -----------------------<br>| Central error: [2418392.436] (EE) systemd-logind: failed to get session: The name org.freedesktop.logi
 n1 was not provided by any .service files<br>| ***********************<br>| [2418392.235]  Entry deleted from font path.<br>| [2418392.235] (==) FontPath set to:<br>| <br>| [2418392.235] (==) ModulePath set to "/usr/lib64/xorg/modules"<br>| [2418392.236] (II) Loader magic: 0x7f0f40<br>| [2418392.236] (II) Module ABI versions:<br>| [2418392.244]   X.Org ANSI C Emulation: 0.4<br>| [2418392.244]    X.Org Video Driver: 18.0<br>| [2418392.244]       X.Org XInput driver : 21.0<br>| [2418392.244]     X.Org Server Extension : 8.0<br>| [2418392.436] (EE) systemd-logind: failed to get session: The name org.freedesktop.login1 was not provided by any .service files<br>| [2418392.544] (--) PCI:*(0:0:2:0) 15ad:0405:15ad:0405 rev 0, Mem @ 0xfd000000/16777216, 0xfe000000/65536, I/O @ 0x0000c070/16, BIOS @ 0x????????/65536<br>| [2418392.555] (WW) Open ACPI failed (/var/run/acpid.socket) (No such file or directory)<br>| [2418392.573] (II) LoadModule: "glx"<br>| [2418392.646] (WW) Warning, couldn't open module g
 lx<br>| [2418392.648] (II) UnloadModule: "glx"<br>| [2418392.649] (II) Unloading glx<br>| [2418392.649] (EE) Failed to load module "glx" (module does not exist, 0)<br>| [2418392.651] (==) Matched vmware as autoconfigured driver 0<br>| [2418392.652] (==) Matched modesetting as autoconfigured driver 1<br>| [2418392.652] (==) Matched fbdev as autoconfigured driver 2<br>| ***********************<br>| 1 errors found in logs.<br>| <br>| ----------------------------------------------------------------------<br>| Ran 17 tests in 25.312s<br>| <br>| FAILED (failures=1, skipped=16)<br>| NOTE: Sending SIGTERM to runqemu<br>| DEBUG: Python function do_testimage finished<br>| ERROR: Function failed: core-image-sato - FAILED - check the task log and the ssh log<br>| Test modules  ['oeqa.runtime.ping', 'oeqa.runtime.ssh', 'oeqa.runtime.connman', 'oeqa.runtime.xorg', 'oeqa.runtime.multilib', 'oeqa.runtime.dmesg', 'oeqa.runtime.buildcvs', 'oeqa.runtime.buildiptables', 'oeqa.runtime.buildsudoku', 'oeq
 a.runtime.date', 'oeqa.runtime.df', 'oeqa.runtime.gcc', 'oeqa.runtime.kernelmodule', 'oeqa.runtime.ldd', 'oeqa.runtime.logrotate', 'oeqa.runtime.pam', 'oeqa.runtime.parselogs', 'oeqa.runtime.perl', 'oeqa.runtime.python', 'oeqa.runtime.rpm', 'oeqa.runtime.scanelf', 'oeqa.runtime.scp', 'oeqa.runtime.skeletoninit', 'oeqa.runtime.smart', 'oeqa.runtime.syslog', 'oeqa.runtime.systemd', 'oeqa.runtime.vnc', 'oeqa.runtime.x32lib']<br>| Found 67 tests<br>| Machine information:<br>| *******************************<br>| Machine name: qemux86-64<br>| CPU:  Intel(R) Core(TM)2 Duo CPU     T7700  @ 2.40GHz<br>| Arch: x86_64<br>| Physical cores: 1<br>| Logical cores: 1<br>| *******************************<br>| <br>ERROR: Task 0 (/home/pokybuild/yocto-autobuilder/yocto-worker/nightly-multilib/build/meta/recipes-sato/images/core-image-sato.bb, do_testimage) failed with exit code '1'<br>Summary: There was 1 ERROR message shown, returning a non-zero exit code.
</p>
<br><br>
<b>-The Yocto BuildBot</b>