<h4>Build status: FAILURE</h4>
Build worker for this Build: <b>fedora20.osl.yoctoproject.org</b>
<br>
Complete logs for all build steps: <a href="http://autobuilder.yoctoproject.org/main/builders/nightly-ppc/builds/97">http://autobuilder.yoctoproject.org/main/builders/nightly-ppc/builds/97</a>
<br>
Build Reason: Triggerable(trigger_main-build)
<br>
Build Properties:<br>
<ul>
<li>Contents of bblayers.conf (Note. LCONF_VERSION will not show up correctly)<br><code>
LCONF_VERSION = <LCONF> <br>
BBPATH = "${TOPDIR}" <br>
BBFILES ?="" <br>
BBLAYERS += " \ <br>
/home/pokybuild/yocto-autobuilder/yocto-worker/nightly-ppc/build/meta \ <br>
/home/pokybuild/yocto-autobuilder/yocto-worker/nightly-ppc/build/meta-yocto \ <br>
/home/pokybuild/yocto-autobuilder/yocto-worker/nightly-ppc/build/meta-yocto-bsp \ <br>
/home/pokybuild/yocto-autobuilder/yocto-worker/nightly-ppc/build/meta-qt3 \ <br>
" <br>
<br></code></li>
<li>DEST : /srv/www/vhosts/autobuilder.yoctoproject.org/pub/nightly/20141108-2</li>
<li>Contents of auto.conf (local.conf for autobuilders)<br><code>
INHERIT += "report-error"<br>
DISTRO = "poky"<br>
PACKAGE_CLASSES = "package_rpm package_deb package_ipk"<br>
BB_NUMBER_THREADS = "16"<br>
PARALLEL_MAKE = "-j 16"<br>
SDKMACHINE ?= "x86_64"<br>
BB_TASK_NICE_LEVEL = "5"<br>
IMAGE_FSTYPES_append = " tar.gz"<br>
BB_TASK_NICE_LEVEL_task-testimage = "0"<br>
DL_DIR = "/srv/www/vhosts/autobuilder.yoctoproject.org/current_sources"<br>
SSTATE_DIR ?= "/srv/www/vhosts/autobuilder.yoctoproject.org/pub/sstate/" <br>
MACHINE = "qemuppc"<br>
PREMIRRORS = ""<br>
BB_GENERATE_MIRROR_TARBALLS = "1"<br>
ADTREPO = "http://adtrepo.yoctoproject.org//1.7"<br>
<br></code></li>
<li>MACHINE : qemuppc</li>
<li>branch : master-next</li>
<li>branch_bitbake : master</li>
<li>branch_eclipse-poky-juno : master</li>
<li>branch_eclipse-poky-kepler : master</li>
<li>branch_meta-fsl-arm : master</li>
<li>branch_meta-fsl-ppc : master</li>
<li>branch_meta-intel : master</li>
<li>branch_meta-minnow : master</li>
<li>branch_meta-qt3 : master</li>
<li>branch_oecore : master</li>
<li>branch_poky : master-next</li>
<li>builddir : /home/pokybuild/yocto-autobuilder/yocto-worker/nightly-ppc</li>
<li>buildername : nightly-ppc</li>
<li>buildnumber : 97</li>
<li>commit-description : dizzy-12.0.0</li>
<li>commit_bitbake : 9f171ea755644ecd9d2b3d7ed13bf8ec09ec917a</li>
<li>commit_eclipse-poky-juno : 26bfc407781aa185f244a47ba63120343cee4a37</li>
<li>commit_eclipse-poky-kepler : 4a167fd662262ebdaa3cf0d332ac0debb52d7904</li>
<li>commit_meta-fsl-arm : a60fe9e69b01cac92825808b02eaaf186a086819</li>
<li>commit_meta-fsl-ppc : deb326df1489d4844f911605a2627f95c89b167f</li>
<li>commit_meta-intel : 0f6d30a95c84ec239f5a30bbfba17ed42e2cf284</li>
<li>commit_meta-minnow : 13a5f2ab84c7284647a3e067a33109c11dae0568</li>
<li>commit_meta-qt3 : 3016129d90b7ac8517a5227d819f10ad417b5b45</li>
<li>commit_oecore : d301ef7c2a5e857bd87be2a24251243ff181fa24</li>
<li>commit_poky : 0927bfc89cc32a0a7b08e6f2b3e43122396414d9</li>
<li>commit_resolvedhead_bitbake : 9f171ea755644ecd9d2b3d7ed13bf8ec09ec917a</li>
<li>commit_resolvedhead_eclipse-poky-juno : 26bfc407781aa185f244a47ba63120343cee4a37</li>
<li>commit_resolvedhead_eclipse-poky-kepler : 4a167fd662262ebdaa3cf0d332ac0debb52d7904</li>
<li>commit_resolvedhead_meta-fsl-arm : a60fe9e69b01cac92825808b02eaaf186a086819</li>
<li>commit_resolvedhead_meta-fsl-ppc : deb326df1489d4844f911605a2627f95c89b167f</li>
<li>commit_resolvedhead_meta-intel : 0f6d30a95c84ec239f5a30bbfba17ed42e2cf284</li>
<li>commit_resolvedhead_meta-minnow : 13a5f2ab84c7284647a3e067a33109c11dae0568</li>
<li>commit_resolvedhead_meta-qt3 : 3016129d90b7ac8517a5227d819f10ad417b5b45</li>
<li>commit_resolvedhead_oecore : d301ef7c2a5e857bd87be2a24251243ff181fa24</li>
<li>commit_resolvedhead_poky : 0927bfc89cc32a0a7b08e6f2b3e43122396414d9</li>
<li>distroversion : 1.7</li>
<li>got_revision : 0927bfc89cc32a0a7b08e6f2b3e43122396414d9</li>
<li>got_revision_meta-qt3 : 3016129d90b7ac8517a5227d819f10ad417b5b45</li>
<li>got_revision_poky : 0927bfc89cc32a0a7b08e6f2b3e43122396414d9</li>
<li>layerversion_core : 4</li>
<li>layerversion_yoctobsp : 3</li>
<li>repo_bitbake : git://git.openembedded.org/bitbake</li>
<li>repo_eclipse-poky-juno : git://git.yoctoproject.org/eclipse-poky-juno</li>
<li>repo_eclipse-poky-kepler : git://git.yoctoproject.org/eclipse-poky-kepler</li>
<li>repo_meta-fsl-arm : git://git.yoctoproject.org/meta-fsl-arm</li>
<li>repo_meta-fsl-ppc : git://git.yoctoproject.org/meta-fsl-ppc</li>
<li>repo_meta-intel : git://git.yoctoproject.org/meta-intel</li>
<li>repo_meta-minnow : git://git.yoctoproject.org/meta-minnow</li>
<li>repo_meta-qt3 : git://git.yoctoproject.org/meta-qt3</li>
<li>repo_oecore : git://git.openembedded.org/openembedded-core</li>
<li>repo_poky : git://git.yoctoproject.org/poky</li>
<li>repository : git://git.yoctoproject.org/poky</li>
<li>repourl_meta-qt3 : git://git.yoctoproject.org/meta-qt3</li>
<li>repourl_poky : git://git.yoctoproject.org/poky</li>
<li>revision : 0927bfc89cc32a0a7b08e6f2b3e43122396414d9</li>
<li>scheduler : trigger_main-build</li>
<li>slavename : fedora20.osl.yoctoproject.org</li>
<li>workdir : /home/pokybuild/yocto-autobuilder/yocto-worker/nightly-ppc</li>
</ul>
<i>Detailed log of last build step:</i> <a href="http://autobuilder.yoctoproject.org/main/builders/nightly-ppc/builds/97/steps/Running Sanity Tests/logs/stdio">http://autobuilder.yoctoproject.org/main/builders/nightly-ppc/builds/97/steps/Running Sanity Tests/logs/stdio</a>
<br>
<h4>Last 60 lines of "Running Sanity Tests.stdio" Error log:</h4>
<p>
| test_dmesg (oeqa.runtime.dmesg.DmesgTest) ... ok<br>| test_python_exists (oeqa.runtime.python.PythonTest) ... ok<br>| test_python_stdout (oeqa.runtime.python.PythonTest) ... ok<br>| test_python_testfile (oeqa.runtime.python.PythonTest) ... ok<br>| test_parselogs (oeqa.runtime.parselogs.ParseLogsTest) ... FAIL<br>| <br>| ======================================================================<br>| FAIL: test_parselogs (oeqa.runtime.parselogs.ParseLogsTest)<br>| ----------------------------------------------------------------------<br>| Traceback (most recent call last):<br>|   File "/home/pokybuild/yocto-autobuilder/yocto-worker/nightly-ppc/build/meta/lib/oeqa/utils/decorators.py", line 79, in wrapped_f<br>|     return f(*args)<br>|   File "/home/pokybuild/yocto-autobuilder/yocto-worker/nightly-ppc/build/meta/lib/oeqa/runtime/parselogs.py", line 178, in test_parselogs<br>|     self.assertEqual(errcount, 0, msg=self.msg)<br>| AssertionError: 1 != 0 : Log: /var/log//Xorg.0.log<br>| ----
 -------------------<br>| Central error: [2414418.418] (EE) systemd-logind: failed to get session: The name org.freedesktop.login1 was not provided by any .service files<br>| ***********************<br>| [2414418.252]     Entry deleted from font path.<br>| [2414418.252] (==) FontPath set to:<br>| <br>| [2414418.253] (==) ModulePath set to "/usr/lib/xorg/modules"<br>| [2414418.257] (II) Loader magic: 0x101f55f8<br>| [2414418.258] (II) Module ABI versions:<br>| [2414418.258]   X.Org ANSI C Emulation: 0.4<br>| [2414418.258]    X.Org Video Driver: 18.0<br>| [2414418.258]       X.Org XInput driver : 21.0<br>| [2414418.259]     X.Org Server Extension : 8.0<br>| [2414418.418] (EE) systemd-logind: failed to get session: The name org.freedesktop.login1 was not provided by any .service files<br>| [2414418.458] (--) PCI:*(0:0:14:0) 1234:1111:1af4:1100 rev 0, Mem @ 0x81000000/16777216, 0x82000000/4096, BIOS @ 0x????????/65536<br>| [2414418.465] (II) LoadModule: "glx"<br>| [2414418.508] (WW) Warning, couldn't 
 open module glx<br>| [2414418.508] (II) UnloadModule: "glx"<br>| [2414418.509] (II) Unloading glx<br>| [2414418.509] (EE) Failed to load module "glx" (module does not exist, 0)<br>| [2414418.510] (II) LoadModule: "fbdev"<br>| [2414418.522] (II) Loading /usr/lib/xorg/modules/drivers/fbdev_drv.so<br>| [2414418.537] (II) Module fbdev: vendor="X.Org Foundation"<br>| [2414418.538]   compiled for 1.16.1, module version = 0.4.4<br>| ***********************<br>| 1 errors found in logs.<br>| <br>| ----------------------------------------------------------------------<br>| Ran 49 tests in 1396.395s<br>| <br>| FAILED (failures=1)<br>| NOTE: Sending SIGTERM to runqemu<br>| DEBUG: Python function do_testimage finished<br>| ERROR: Function failed: core-image-sato-sdk - FAILED - check the task log and the ssh log<br>| Machine information:<br>| *******************************<br>| Machine name: qemuppc<br>| CPU:<br>| Arch: ppc<br>| Physical cores:<br>| Logical cores: 1<br>| *************************
 ******<br>| <br>ERROR: Task 2 (/home/pokybuild/yocto-autobuilder/yocto-worker/nightly-ppc/build/meta/recipes-sato/images/core-image-sato-sdk.bb, do_testimage) failed with exit code '1'<br>Summary: There were 2 ERROR messages shown, returning a non-zero exit code.
</p>
<br><br>
<b>-The Yocto BuildBot</b>