<h4>Build status: FAILURE</h4>
Build worker for this Build: <b>debian7.osl.yoctoproject.org</b>
<br>
Complete logs for all build steps: <a href="http://autobuilder.yoctoproject.org/main/builders/nightly-deb/builds/53">http://autobuilder.yoctoproject.org/main/builders/nightly-deb/builds/53</a>
<br>
Build Reason: Triggerable(trigger_main-build)
<br>
Build Properties:<br>
<ul>
<li>Contents of bblayers.conf (Note. LCONF_VERSION will not show up correctly)<br><code>
LCONF_VERSION = <LCONF> <br>
BBPATH = "${TOPDIR}" <br>
BBFILES ?="" <br>
BBLAYERS += " \ <br>
/home/pokybuild/yocto-autobuilder/yocto-worker/nightly-deb/build/meta \ <br>
/home/pokybuild/yocto-autobuilder/yocto-worker/nightly-deb/build/meta-yocto \ <br>
/home/pokybuild/yocto-autobuilder/yocto-worker/nightly-deb/build/meta-yocto-bsp \ <br>
/home/pokybuild/yocto-autobuilder/yocto-worker/nightly-deb/build/meta-qt3 \ <br>
" <br>
<br></code></li>
<li>DEST : /srv/www/vhosts/autobuilder.yoctoproject.org/pub/nightly/20141001-1</li>
<li>Contents of auto.conf (local.conf for autobuilders)<br><code>
INHERIT += "report-error"<br>
DISTRO = "poky"<br>
PACKAGE_CLASSES = "package_deb"<br>
BB_NUMBER_THREADS = "16"<br>
PARALLEL_MAKE = "-j 16"<br>
SDKMACHINE ?= "i686"<br>
BB_TASK_NICE_LEVEL = "5"<br>
IMAGE_FSTYPES_append = " tar.gz"<br>
BB_TASK_NICE_LEVEL_task-testimage = "0"<br>
DL_DIR = "/srv/www/vhosts/autobuilder.yoctoproject.org/current_sources"<br>
SSTATE_DIR ?= "/srv/www/vhosts/autobuilder.yoctoproject.org/pub/sstate/" <br>
MACHINE = "qemux86"<br>
PREMIRRORS = ""<br>
BB_GENERATE_MIRROR_TARBALLS = "1"<br>
ADTREPO = "http://adtrepo.yoctoproject.org//1.7"<br>
<br></code></li>
<li>MACHINE : qemux86</li>
<li>branch : master-next</li>
<li>branch_bitbake : master</li>
<li>branch_eclipse-poky-juno : master</li>
<li>branch_eclipse-poky-kepler : master</li>
<li>branch_meta-fsl-arm : master</li>
<li>branch_meta-fsl-ppc : master</li>
<li>branch_meta-intel : master</li>
<li>branch_meta-minnow : master</li>
<li>branch_meta-qt3 : master</li>
<li>branch_oecore : master</li>
<li>branch_poky : master-next</li>
<li>builddir : /home/pokybuild/yocto-autobuilder/yocto-worker/nightly-deb</li>
<li>buildername : nightly-deb</li>
<li>buildnumber : 53</li>
<li>commit-description : daisy-11.0.1</li>
<li>commit_bitbake : afa2431c21b8271b05dc4cca4265f98d9f338007</li>
<li>commit_eclipse-poky-juno : 26bfc407781aa185f244a47ba63120343cee4a37</li>
<li>commit_eclipse-poky-kepler : 4a167fd662262ebdaa3cf0d332ac0debb52d7904</li>
<li>commit_meta-fsl-arm : 2680f54d02fa6efe4cd2aaef7bda9e46cf3e9672</li>
<li>commit_meta-fsl-ppc : deb326df1489d4844f911605a2627f95c89b167f</li>
<li>commit_meta-intel : b25eb7e4dfee7802d4eae657fa5e482a1a010190</li>
<li>commit_meta-minnow : 13a5f2ab84c7284647a3e067a33109c11dae0568</li>
<li>commit_meta-qt3 : 3016129d90b7ac8517a5227d819f10ad417b5b45</li>
<li>commit_oecore : ae8319fb460b5d588044f6b00bf73255773f4ff0</li>
<li>commit_poky : 60cf4c1cd8075aa8ffbec49b5da40822cf818a43</li>
<li>commit_resolvedhead_bitbake : afa2431c21b8271b05dc4cca4265f98d9f338007</li>
<li>commit_resolvedhead_eclipse-poky-juno : 26bfc407781aa185f244a47ba63120343cee4a37</li>
<li>commit_resolvedhead_eclipse-poky-kepler : 4a167fd662262ebdaa3cf0d332ac0debb52d7904</li>
<li>commit_resolvedhead_meta-fsl-arm : 2680f54d02fa6efe4cd2aaef7bda9e46cf3e9672</li>
<li>commit_resolvedhead_meta-fsl-ppc : deb326df1489d4844f911605a2627f95c89b167f</li>
<li>commit_resolvedhead_meta-intel : b25eb7e4dfee7802d4eae657fa5e482a1a010190</li>
<li>commit_resolvedhead_meta-minnow : 13a5f2ab84c7284647a3e067a33109c11dae0568</li>
<li>commit_resolvedhead_meta-qt3 : 3016129d90b7ac8517a5227d819f10ad417b5b45</li>
<li>commit_resolvedhead_oecore : ae8319fb460b5d588044f6b00bf73255773f4ff0</li>
<li>commit_resolvedhead_poky : 60cf4c1cd8075aa8ffbec49b5da40822cf818a43</li>
<li>distroversion : 1.7</li>
<li>got_revision : 60cf4c1cd8075aa8ffbec49b5da40822cf818a43</li>
<li>got_revision_meta-qt3 : 3016129d90b7ac8517a5227d819f10ad417b5b45</li>
<li>got_revision_poky : 60cf4c1cd8075aa8ffbec49b5da40822cf818a43</li>
<li>layerversion_core : 4</li>
<li>layerversion_yoctobsp : 3</li>
<li>repo_bitbake : git://git.openembedded.org/bitbake</li>
<li>repo_eclipse-poky-juno : git://git.yoctoproject.org/eclipse-poky-juno</li>
<li>repo_eclipse-poky-kepler : git://git.yoctoproject.org/eclipse-poky-kepler</li>
<li>repo_meta-fsl-arm : git://git.yoctoproject.org/meta-fsl-arm</li>
<li>repo_meta-fsl-ppc : git://git.yoctoproject.org/meta-fsl-ppc</li>
<li>repo_meta-intel : git://git.yoctoproject.org/meta-intel</li>
<li>repo_meta-minnow : git://git.yoctoproject.org/meta-minnow</li>
<li>repo_meta-qt3 : git://git.yoctoproject.org/meta-qt3</li>
<li>repo_oecore : git://git.openembedded.org/openembedded-core</li>
<li>repo_poky : git://git.yoctoproject.org/poky</li>
<li>repository : git://git.yoctoproject.org/poky</li>
<li>repourl_meta-qt3 : git://git.yoctoproject.org/meta-qt3</li>
<li>repourl_poky : git://git.yoctoproject.org/poky</li>
<li>revision : 60cf4c1cd8075aa8ffbec49b5da40822cf818a43</li>
<li>scheduler : trigger_main-build</li>
<li>slavename : debian7.osl.yoctoproject.org</li>
<li>workdir : /home/pokybuild/yocto-autobuilder/yocto-worker/nightly-deb</li>
</ul>
<i>Detailed log of last build step:</i> <a href="http://autobuilder.yoctoproject.org/main/builders/nightly-deb/builds/53/steps/Running Sanity Tests_1/logs/stdio">http://autobuilder.yoctoproject.org/main/builders/nightly-deb/builds/53/steps/Running Sanity Tests_1/logs/stdio</a>
<br>
<h4>Last 60 lines of "Running Sanity Tests_1.stdio" Error log:</h4>
<p>
| IPv6: ADDRCONF(NETDEV_UP): eth0: link is not ready<br>| usb 1-1: new full-speed USB device number 2 using uhci_hcd<br>| usbhid 1-1:1.0: can't add hid device: -32<br>| usbhid: probe of 1-1:1.0 failed with error -32<br>| input: ImExPS/2 Generic Explorer Mouse as /devices/platform/i8042/serio1/input/input3<br>| e1000: eth0 NIC Link is Up 1000 Mbps Full Duplex, Flow Control: RX<br>| IPv6: ADDRCONF(NETDEV_CHANGE): eth0: link becomes ready<br>| IP-Config: Complete:<br>|      device=eth0, hwaddr=52:54:00:12:34:56, ipaddr=192.168.7.2, mask=255.255.255.0, gw=192.168.7.1<br>|      host=192.168.7.2, domain=, nis-domain=(none)<br>|      bootserver=255.255.255.255, rootserver=255.255.255.255, rootpath=<br>| ALSA device list:<br>|   No soundcards found.<br>| ***********************<br>| Central error: usbhid: probe of 1-1:1.0 failed with error -32<br>| ***********************<br>| Key type dns_resolver registered<br>| mce: Unable to init device /dev/mcelog (rc: -5)<br>| Using IPI No-Shortcut mod
 e<br>| Btrfs loaded<br>| console [netcon0] enabled<br>| netconsole: network logging started<br>| rtc_cmos 00:00: setting system clock to 2014-10-01 11:02:31 UTC (1412161351)<br>| IPv6: ADDRCONF(NETDEV_UP): eth0: link is not ready<br>| usb 1-1: new full-speed USB device number 2 using uhci_hcd<br>| usbhid 1-1:1.0: can't add hid device: -32<br>| usbhid: probe of 1-1:1.0 failed with error -32<br>| input: ImExPS/2 Generic Explorer Mouse as /devices/platform/i8042/serio1/input/input3<br>| e1000: eth0 NIC Link is Up 1000 Mbps Full Duplex, Flow Control: RX<br>| IPv6: ADDRCONF(NETDEV_CHANGE): eth0: link becomes ready<br>| IP-Config: Complete:<br>|      device=eth0, hwaddr=52:54:00:12:34:56, ipaddr=192.168.7.2, mask=255.255.255.0, gw=192.168.7.1<br>|      host=192.168.7.2, domain=, nis-domain=(none)<br>|      bootserver=255.255.255.255, rootserver=255.255.255.255, rootpath=<br>| ALSA device list:<br>|   No soundcards found.<br>| md: Waiting for all devices to be available before autodetect<b
 r>| ***********************<br>| 2 errors found in logs.<br>| <br>| ----------------------------------------------------------------------<br>| Ran 16 tests in 40.670s<br>| <br>| FAILED (failures=2, skipped=17)<br>| NOTE: Sending SIGTERM to runqemu<br>| DEBUG: Python function do_testimage finished<br>| ERROR: Function failed: core-image-sato - FAILED - check the task log and the ssh log<br>| Test modules  ['oeqa.runtime.ping', 'oeqa.runtime.ssh', 'oeqa.runtime.buildcvs', 'oeqa.runtime.buildiptables', 'oeqa.runtime.buildsudoku', 'oeqa.runtime.connman', 'oeqa.runtime.date', 'oeqa.runtime.df', 'oeqa.runtime.dmesg', 'oeqa.runtime.gcc', 'oeqa.runtime.kernelmodule', 'oeqa.runtime.ldd', 'oeqa.runtime.logrotate', 'oeqa.runtime.multilib', 'oeqa.runtime.pam', 'oeqa.runtime.parselogs', 'oeqa.runtime.perl', 'oeqa.runtime.python', 'oeqa.runtime.rpm', 'oeqa.runtime.scanelf', 'oeqa.runtime.scp', 'oeqa.runtime.skeletoninit', 'oeqa.runtime.smart', 'oeqa.runtime.syslog', 'oeqa.runtime.systemd', 'oeqa
 .runtime.vnc', 'oeqa.runtime.x32lib', 'oeqa.runtime.xorg']<br>| Found 67 tests<br>| Machine information:<br>| *******************************<br>| Machine name: qemux86<br>| CPU:  QEMU Virtual CPU version 2.1.0<br>| Arch: i686<br>| Physical cores: 1<br>| Logical cores: 1<br>| *******************************<br>| <br>ERROR: Task 0 (/home/pokybuild/yocto-autobuilder/yocto-worker/nightly-deb/build/meta/recipes-sato/images/core-image-sato.bb, do_testimage) failed with exit code '1'<br>Summary: There was 1 ERROR message shown, returning a non-zero exit code.
</p>
<i>Detailed log of last build step:</i> <a href="http://autobuilder.yoctoproject.org/main/builders/nightly-deb/builds/53/steps/Running Sanity Tests_2/logs/stdio">http://autobuilder.yoctoproject.org/main/builders/nightly-deb/builds/53/steps/Running Sanity Tests_2/logs/stdio</a>
<br>
<h4>Last 60 lines of "Running Sanity Tests_2.stdio" Error log:</h4>
<p>
| NOTE: SSH log file: /home/pokybuild/yocto-autobuilder/yocto-worker/nightly-deb/build/build/tmp/work/qemux86-poky-linux/core-image-sato-sdk/1.0-r0/testimage/ssh_target_log.20141001110351<br>| NOTE: runqemu started, pid is 30826<br>| NOTE: waiting at most 60 seconds for qemu pid<br>| NOTE: qemu started - qemu procces pid is 30884<br>| NOTE: Target IP: 192.168.7.2<br>| NOTE: Server IP: 192.168.7.1<br>| NOTE: Waiting at most 1500 seconds for login banner<br>| NOTE: Connection from 127.0.0.1:45723<br>| NOTE: Reached login banner<br>| test_ping (oeqa.runtime.ping.PingTest) ... ok<br>| test_ssh (oeqa.runtime.ssh.SshTest) ... ok<br>| test_df (oeqa.runtime.df.DfTest) ... ok<br>| test_connmand_help (oeqa.runtime.connman.ConnmanTest) ... ok<br>| test_connmand_running (oeqa.runtime.connman.ConnmanTest) ... ok<br>| test_syslog_help (oeqa.runtime.syslog.SyslogTest) ... ok<br>| test_syslog_running (oeqa.runtime.syslog.SyslogTest) ... ok<br>| test_syslog_logger (oeqa.runtime.syslog.SyslogTestConfi
 g) ... ok<br>| test_syslog_restart (oeqa.runtime.syslog.SyslogTestConfig) ... ok<br>| test_syslog_startup_config (oeqa.runtime.syslog.SyslogTestConfig) ... ok<br>| test_xorg_running (oeqa.runtime.xorg.XorgTest) ... ok<br>| test_scp_file (oeqa.runtime.scp.ScpTest) ... ok<br>| test_vnc (oeqa.runtime.vnc.VNCTest) ... ok<br>| test_date (oeqa.runtime.date.DateTest) ... ok<br>| test_perl_exists (oeqa.runtime.perl.PerlTest) ... ok<br>| test_perl_works (oeqa.runtime.perl.PerlTest) ... ok<br>| test_ldd_exists (oeqa.runtime.ldd.LddTest) ... ok<br>| test_ldd_rtldlist_check (oeqa.runtime.ldd.LddTest) ... ok<br>| test_gcc_compile (oeqa.runtime.gcc.GccCompileTest) ... ok<br>| test_gpp2_compile (oeqa.runtime.gcc.GccCompileTest) ... ok<br>| test_gpp_compile (oeqa.runtime.gcc.GccCompileTest) ... ok<br>| test_make (oeqa.runtime.gcc.GccCompileTest) ... ok<br>| test_kernel_module (oeqa.runtime.kernelmodule.KernelModuleTest) ... ok<br>| test_dmesg (oeqa.runtime.dmesg.DmesgTest) ... FAIL<br>| test_python
 _exists (oeqa.runtime.python.PythonTest) ... ok<br>| test_python_stdout (oeqa.runtime.python.PythonTest) ... ok<br>| test_python_testfile (oeqa.runtime.python.PythonTest) ... ok<br>| <br>| ======================================================================<br>| FAIL: test_dmesg (oeqa.runtime.dmesg.DmesgTest)<br>| ----------------------------------------------------------------------<br>| Traceback (most recent call last):<br>|   File "/home/pokybuild/yocto-autobuilder/yocto-worker/nightly-deb/build/meta/lib/oeqa/utils/decorators.py", line 90, in wrapped_f<br>|     return func(*args)<br>|   File "/home/pokybuild/yocto-autobuilder/yocto-worker/nightly-deb/build/meta/lib/oeqa/utils/decorators.py", line 79, in wrapped_f<br>|     return f(*args)<br>|   File "/home/pokybuild/yocto-autobuilder/yocto-worker/nightly-deb/build/meta/lib/oeqa/runtime/dmesg.py", line 12, in test_dmesg<br>|     self.assertEqual(status, 1, msg = "Error messages in dmesg log: %s" % output)<br>| AssertionError: 0
  != 1 : Error messages in dmesg log: [    9.454571] usbhid: probe of 1-1:1.0 failed with error -32<br>| <br>| ----------------------------------------------------------------------<br>| Ran 27 tests in 150.081s<br>| <br>| FAILED (failures=1)<br>| NOTE: Sending SIGTERM to runqemu<br>| DEBUG: Python function do_testimage finished<br>| ERROR: Function failed: core-image-sato-sdk - FAILED - check the task log and the ssh log<br>| Test modules  ['oeqa.runtime.ping', 'oeqa.runtime.ssh', 'oeqa.runtime.df', 'oeqa.runtime.connman', 'oeqa.runtime.syslog', 'oeqa.runtime.xorg', 'oeqa.runtime.scp', 'oeqa.runtime.vnc', 'oeqa.runtime.date', 'oeqa.runtime.perl', 'oeqa.runtime.ldd', 'oeqa.runtime.gcc', 'oeqa.runtime.kernelmodule', 'oeqa.runtime.dmesg', 'oeqa.runtime.python']<br>| Found 27 tests<br>ERROR: Task 0 (/home/pokybuild/yocto-autobuilder/yocto-worker/nightly-deb/build/meta/recipes-sato/images/core-image-sato-sdk.bb, do_testimage) failed with exit code '1'<br>Summary: There was 1 ERROR messag
 e shown, returning a non-zero exit code.
</p>
<br><br>
<b>-The Yocto BuildBot</b>