<h4>Build status: FAILURE</h4>
Buildslave for this Build: <b>fedora20.osl.yoctoproject.org</b>
<br>
Complete logs for all build steps: <a href="http://autobuilder.yoctoproject.org:8011/builders/nightly-mips/builds/31">http://autobuilder.yoctoproject.org:8011/builders/nightly-mips/builds/31</a>
<br>
Build Reason: Triggerable(trigger_main-build)
<br>
Build Properties:<br>
<ul>
<li>Contents of bblayers.conf (Note. LCONF_VERSION will not show up correctly)<br><code>
LCONF_VERSION = <LCONF> <br>
BBPATH = "${TOPDIR}" <br>
BBFILES ?="" <br>
BBLAYERS += " \ <br>
/home/pokybuild/yocto-autobuilder-dev/yocto-slave/nightly-mips/build/meta \ <br>
/home/pokybuild/yocto-autobuilder-dev/yocto-slave/nightly-mips/build/meta-yocto \ <br>
/home/pokybuild/yocto-autobuilder-dev/yocto-slave/nightly-mips/build/meta-yocto-bsp \ <br>
/home/pokybuild/yocto-autobuilder-dev/yocto-slave/nightly-mips/build/meta-qt3 \ <br>
" <br>
<br></code></li>
<li>DEST : /srv/www/vhosts/autobuilder.yoctoproject.org/pub/nightly/20140214-3</li>
<li>DESTDIR : 20140214-3</li>
<li>Contents of auto.conf (local.conf for autobuilders)<br><code>
DISTRO = "poky"<br>
PACKAGE_CLASSES = "package_rpm package_deb package_ipk"<br>
BB_NUMBER_THREADS = "16"<br>
PARALLEL_MAKE = "-j 16"<br>
SDKMACHINE ?= "x86_64"<br>
BB_TASK_NICE_LEVEL = "5"<br>
BB_TASK_NICE_LEVEL_task-testimage = "0"<br>
DL_DIR = "/srv/www/vhosts/autobuilder.yoctoproject.org/current_sources"<br>
SSTATE_DIR ?= "/srv/www/vhosts/autobuilder.yoctoproject.org/pub/sstate/" <br>
MACHINE = "qemumips"<br>
PREMIRRORS = ""<br>
ADTREPO = "http://adtrepo.yoctoproject.org//1.5+snapshot"<br>
<br></code></li>
<li>MACHINE : qemumips</li>
<li>branch : master</li>
<li>branch_meta-qt3 : master</li>
<li>branch_poky : master</li>
<li>builddir : /home/pokybuild/yocto-autobuilder-dev/yocto-slave/nightly-mips</li>
<li>buildername : nightly-mips</li>
<li>buildnumber : 31</li>
<li>commit-description : 1.6_M2</li>
<li>commit_meta-qt3 : 4772424ab69908d4e3b9d6d4717ca889468e6acd</li>
<li>commit_poky : 155f8a4c54bef65235c54945198f1fcddb642ea0</li>
<li>commit_resolvedhead_bitbake : 0753899d1e855795cc18671357609a86f169b379</li>
<li>commit_resolvedhead_eclipse-poky-juno : 26bfc407781aa185f244a47ba63120343cee4a37</li>
<li>commit_resolvedhead_eclipse-poky-kepler : f4d8e9243f9355424a01e2d72fd1abbf68d3bb7c</li>
<li>commit_resolvedhead_meta-fsl-arm : 40385ba8b3060adb3a535c6e5f08199b69f47754</li>
<li>commit_resolvedhead_meta-fsl-ppc : 290a669e5480792836d4f7769ba2ef6f49799323</li>
<li>commit_resolvedhead_meta-intel : 49b97a90ea3bce2a61a8578cface01f32a97e2b3</li>
<li>commit_resolvedhead_meta-minnow : 32e4d6f17917027c3babe1ab738480de9691024d</li>
<li>commit_resolvedhead_meta-qt3 : 4772424ab69908d4e3b9d6d4717ca889468e6acd</li>
<li>commit_resolvedhead_oecore : d3ba249aa1bf68aaeed226e934a4f4d5b7a19286</li>
<li>commit_resolvedhead_poky : 155f8a4c54bef65235c54945198f1fcddb642ea0</li>
<li>distroversion : 1.5+snapshot</li>
<li>got_revision : 155f8a4c54bef65235c54945198f1fcddb642ea0</li>
<li>got_revision_meta-qt3 : 4772424ab69908d4e3b9d6d4717ca889468e6acd</li>
<li>got_revision_poky : 155f8a4c54bef65235c54945198f1fcddb642ea0</li>
<li>layerversion_core : 3</li>
<li>layerversion_yoctobsp : 2</li>
<li>repository : git://git.yoctoproject.org/poky</li>
<li>repourl_meta-qt3 : git://git.yoctoproject.org/meta-qt3</li>
<li>repourl_poky : git://git.yoctoproject.org/poky</li>
<li>revision : 155f8a4c54bef65235c54945198f1fcddb642ea0</li>
<li>scheduler : trigger_main-build</li>
<li>slavename : fedora20.osl.yoctoproject.org</li>
<li>workdir : /home/pokybuild/yocto-autobuilder-dev/yocto-slave/nightly-mips</li>
</ul>
<i>Detailed log of last build step:</i> <a href="http://autobuilder.yoctoproject.org:8011/builders/nightly-mips/builds/31/steps/Running Sanity Tests/logs/stdio">http://autobuilder.yoctoproject.org:8011/builders/nightly-mips/builds/31/steps/Running Sanity Tests/logs/stdio</a>
<br>
<h4>Last 60 lines of "Running Sanity Tests.stdio" Error log:</h4>
<p>
| test_ldd_exists (oeqa.runtime.ldd.LddTest) ... ok<br>| test_ldd_rtldlist_check (oeqa.runtime.ldd.LddTest) ... ok<br>| test_gcc_compile (oeqa.runtime.gcc.GccCompileTest) ... ok<br>| test_gpp_compile (oeqa.runtime.gcc.GccCompileTest) ... ok<br>| test_make (oeqa.runtime.gcc.GccCompileTest) ... ok<br>| test_rpm_help (oeqa.runtime.rpm.RpmBasicTest) ... ok<br>| test_rpm_query (oeqa.runtime.rpm.RpmBasicTest) ... ok<br>| test_rpm_install (oeqa.runtime.rpm.RpmInstallRemoveTest) ... ok<br>| test_rpm_remove (oeqa.runtime.rpm.RpmInstallRemoveTest) ... ok<br>| test_smart_help (oeqa.runtime.smart.SmartBasicTest) ... ok<br>| test_smart_info (oeqa.runtime.smart.SmartBasicTest) ... ok<br>| test_smart_query (oeqa.runtime.smart.SmartBasicTest) ... ok<br>| test_smart_search (oeqa.runtime.smart.SmartBasicTest) ... ok<br>| test_smart_stats (oeqa.runtime.smart.SmartBasicTest) ... ok<br>| test_smart_version (oeqa.runtime.smart.SmartBasicTest) ... ok<br>| Test modules  ['oeqa.runtime.ping', 'oeqa.runtime.s
 sh', 'oeqa.runtime.df', 'oeqa.runtime.connman', 'oeqa.runtime.syslog', 'oeqa.runtime.xorg', 'oeqa.runtime.scp', 'oeqa.runtime.vnc', 'oeqa.runtime.date', 'oeqa.runtime.perl', 'oeqa.runtime.ldd', 'oeqa.runtime.gcc', 'oeqa.runtime.rpm', 'oeqa.runtime.smart', 'oeqa.runtime.kernelmodule', 'oeqa.runtime.dmesg', 'oeqa.runtime.python']<br>| Found 48 tests<br>| test_smart_channel (oeqa.runtime.smart.SmartRepoTest) ... ok<br>| test_smart_channel_add (oeqa.runtime.smart.SmartRepoTest) ... ok<br>| test_smart_channel_help (oeqa.runtime.smart.SmartRepoTest) ... ok<br>| test_smart_channel_list (oeqa.runtime.smart.SmartRepoTest) ... ok<br>| test_smart_channel_rpmsys (oeqa.runtime.smart.SmartRepoTest) ... ok<br>| test_smart_channel_show (oeqa.runtime.smart.SmartRepoTest) ... ok<br>| test_smart_install (oeqa.runtime.smart.SmartRepoTest) ... ok<br>| test_smart_install_dependency (oeqa.runtime.smart.SmartRepoTest) ... ok<br>| test_smart_install_from_disk (oeqa.runtime.smart.SmartRepoTest) ... ok<br>| t
 est_smart_install_from_http (oeqa.runtime.smart.SmartRepoTest) ... ok<br>| test_smart_reinstall (oeqa.runtime.smart.SmartRepoTest) ... ok<br>| test_kernel_module (oeqa.runtime.kernelmodule.KernelModuleTest) ... ok<br>| test_dmesg (oeqa.runtime.dmesg.DmesgTest) ... FAIL<br>| test_python_exists (oeqa.runtime.python.PythonTest) ... ok<br>| test_python_stdout (oeqa.runtime.python.PythonTest) ... ok<br>| test_python_testfile (oeqa.runtime.python.PythonTest) ... ok<br>| <br>| ======================================================================<br>| FAIL: test_dmesg (oeqa.runtime.dmesg.DmesgTest)<br>| ----------------------------------------------------------------------<br>| Traceback (most recent call last):<br>|   File "/home/pokybuild/yocto-autobuilder-dev/yocto-slave/nightly-mips/build/meta/lib/oeqa/utils/decorators.py", line 48, in wrapped_f<br>|     return f(*args)<br>|   File "/home/pokybuild/yocto-autobuilder-dev/yocto-slave/nightly-mips/build/meta/lib/oeqa/runtime/dmesg.py", li
 ne 11, in test_dmesg<br>|     self.assertEqual(status, 1, msg = "Error messages in dmesg log: %s" % output)<br>| AssertionError: 0 != 1 : Error messages in dmesg log: [  100.900000] hda: DMA timeout error<br>| [  100.900000] hda: dma timeout error: status=0x50 { DriveReady SeekComplete }<br>| [  274.100000] hda: DMA timeout error<br>| [  274.100000] hda: dma timeout error: status=0x50 { DriveReady SeekComplete }<br>| [  386.660000] hda: DMA timeout error<br>| [  386.660000] hda: dma timeout error: status=0x50 { DriveReady SeekComplete }<br>| [  454.100000] hda: DMA timeout error<br>| [  454.100000] hda: dma timeout error: status=0x50 { DriveReady SeekComplete }<br>| <br>| ----------------------------------------------------------------------<br>| Ran 48 tests in 6883.659s<br>| <br>| FAILED (failures=1)<br>| NOTE: Sending SIGTERM to runqemu<br>| DEBUG: Python function do_testimage finished<br>| ERROR: Function failed: core-image-sato-sdk - FAILED - check the task log and the ssh log<
 br>ERROR: Task 2 (/home/pokybuild/yocto-autobuilder-dev/yocto-slave/nightly-mips/build/meta/recipes-sato/images/core-image-sato-sdk.bb, do_testimage) failed with exit code '1'<br>Summary: There were 2 ERROR messages shown, returning a non-zero exit code.
</p>
<br><br>
<b>-The Yocto BuildBot</b>