Date   

Re: #zeus meta-intel #zeus

Monsees, Steven C (US)
 

For this test case I was only building in opencl-clang and igc...

If I attempt to build in intel-compute-runtime, iy attempts to make use of igc and I see the following build issue:

08:11 smonsees@yix490031 /disk0/scratch/smonsees/yocto/workspace_1/builds2/sbcb-default>bitbake intel-compute-runtime
Loading cache: 100% |######################################################################################################| Time: 0:00:00
Loaded 3672 entries from dependency cache.
NOTE: Resolving any missing task queue dependencies

Build Configuration:
BB_VERSION = "1.44.0"
BUILD_SYS = "x86_64-linux"
NATIVELSBSTRING = "rhel-7.9"
TARGET_SYS = "x86_64-poky-linux"
MACHINE = "sbcb-default"
DISTRO = "limws"
DISTRO_VERSION = "3.0.4"
TUNE_FEATURES = "m64 corei7"
TARGET_FPU = ""
meta
meta-poky = "my_yocto_3.0.4:9662755c328d9406cccb206f6e67945f6894789b"
meta-perl
meta-python
meta-filesystems
meta-networking
meta-initramfs
meta-oe = "zeus:2b5dd1eb81cd08bc065bc76125f2856e9383e98b"
meta = "master:a32ddd2b2a51b26c011fa50e441df39304651503"
meta-clang = "zeus:f5355ca9b86fb5de5930132ffd95a9b352d694f9"
meta-intel = "zeus:d9942d4c3a710406b051852de7232db03c297f4e"
meta-intel = "LIMWSSWARE-423-oews-meta-bae-merge:fa33549eca95293aeec58bf0624b3315c08fdba0"

Initialising tasks: 100% |#################################################################################################| Time: 0:00:01
Checking sstate mirror object availability: 100% |#########################################################################| Time: 0:00:00
Sstate summary: Wanted 176 Found 166 Missed 10 Current 284 (94% match, 97% complete)
NOTE: Executing Tasks
NOTE: Setscene tasks completed
ERROR: intel-graphics-compiler-native-1.0.11-r0 do_compile: Execution of '/disk0/scratch/smonsees/yocto/workspace_1/builds2/sbcb-default/tmp/work/x86_64-linux/intel-graphics-compiler-native/1.0.11-r0/temp/run.do_compile.26870' failed with exit code 1:
[1/565] cd /disk0/scratch/smonsees/yocto/workspace_1/builds2/sbcb-default/tmp/work/x86_64-linux/intel-graphics-compiler-native/1.0.11-r0/git/visa && /disk0/scratch/smonsees/yocto/workspace_1/builds2/sbcb-default/tmp/work/x86_64-linux/intel-graphics-compiler-native/1.0.11-r0/recipe-sysroot-native/usr/bin/flex -PCISA -o/disk0/scratch/smonsees/yocto/workspace_1/builds2/sbcb-default/tmp/work/x86_64-linux/intel-graphics-compiler-native/1.0.11-r0/build/IGC/visa/lex.CISA.cpp CISA.l
CISA.l:486: warning, rule cannot be matched
[2/565] cd /disk0/scratch/smonsees/yocto/workspace_1/builds2/sbcb-default/tmp/work/x86_64-linux/intel-graphics-compiler-native/1.0.11-r0/build/IGC/BiFModule && /disk0/scratch/smonsees/yocto/workspace_1/builds2/sbcb-default/tmp/work/x86_64-linux/intel-graphics-compiler-native/1.0.11-r0/recipe-sysroot-native/usr/bin/cmake -E make_directory /disk0/scratch/smonsees/yocto/workspace_1/builds2/sbcb-default/tmp/work/x86_64-linux/intel-graphics-compiler-native/1.0.11-r0/build/IGC/Release/bif/. && /disk0/scratch/smonsees/yocto/workspace_1/builds2/sbcb-default/tmp/hosttools/python3 /disk0/scratch/smonsees/yocto/workspace_1/builds2/sbcb-default/tmp/work/x86_64-linux/intel-graphics-compiler-native/1.0.11-r0/git/IGC/BiFModule/concat.py -new /disk0/scratch/smonsees/yocto/workspace_1/builds2/sbcb-default/tmp/work/x86_64-linux/intel-graphics-compiler-native/1.0.11-r0/build/IGC/Release/bif/./opencl_cth.h /disk0/scratch/smonsees/yocto/workspace_1/builds2/sbcb-default/tmp/work/x86_64-linux/intel-graphics-compiler-native/1.0.11-r0/git/IGC/BiFModule/Languages/OpenCL/opencl_cth_released.h /disk0/scratch/smonsees/yocto/workspace_1/builds2/sbcb-default/tmp/work/x86_64-linux/intel-graphics-compiler-native/1.0.11-r0/git/IGC/BiFModule/Languages/OpenCL/PreRelease/opencl_cth_pre_release.h
[3/565] cd /disk0/scratch/smonsees/yocto/workspace_1/builds2/sbcb-default/tmp/work/x86_64-linux/intel-graphics-compiler-native/1.0.11-r0/build/IGC/autogen/MDAutogen && /disk0/scratch/smonsees/yocto/workspace_1/builds2/sbcb-default/tmp/hosttools/python3 /disk0/scratch/smonsees/yocto/workspace_1/builds2/sbcb-default/tmp/work/x86_64-linux/intel-graphics-compiler-native/1.0.11-r0/git/IGC/common/autogen.py /disk0/scratch/smonsees/yocto/workspace_1/builds2/sbcb-default/tmp/work/x86_64-linux/intel-graphics-compiler-native/1.0.11-r0/git/IGC/common/MDFrameWork.h /disk0/scratch/smonsees/yocto/workspace_1/builds2/sbcb-default/tmp/work/x86_64-linux/intel-graphics-compiler-native/1.0.11-r0/build/IGC/autogen/MDNodeFunctions.gen
[4/565] cd /disk0/scratch/smonsees/yocto/workspace_1/builds2/sbcb-default/tmp/work/x86_64-linux/intel-graphics-compiler-native/1.0.11-r0/build/IGC/GenISAIntrinsics && /disk0/scratch/smonsees/yocto/workspace_1/builds2/sbcb-default/tmp/hosttools/python3 /disk0/scratch/smonsees/yocto/workspace_1/builds2/sbcb-default/tmp/work/x86_64-linux/intel-graphics-compiler-native/1.0.11-r0/git/IGC/GenISAIntrinsics/Intrinsics.py Intrinsic_definitions.py /disk0/scratch/smonsees/yocto/workspace_1/builds2/sbcb-default/tmp/work/x86_64-linux/intel-graphics-compiler-native/1.0.11-r0/build/IGC/Release/IntrinsicGenISA.gen
[5/565] /disk0/scratch/smonsees/yocto/workspace_1/builds2/sbcb-default/tmp/hosttools/g++ -DCL_KHR_FP64_EXT -DGHAL3D=USC -DICBE_LINUX -DIGC_CMAKE -DIGC_EXPORTS=1 -DIGC_SPIRV_ENABLED -DINSIDE_PLUGIN -DISTDLIB_UMD -DLINUX -DNDEBUG -DNOMINMAX -DSTD_CALL -DUSC_EXPORTS=1 -DUSE_MMX -DUSE_SSE -DUSE_SSE2 -DUSE_SSE3 -DUSE_SSSE3 -D_AMD64_ -D_COMPILER_DLL_ -D_CRT_SECURE_NO_WARNINGS -D_HAS_EXCEPTIONS=0 -D_IGC_ -D_SCL_SECURE_NO_WARNINGS -D__STDC_CONSTANT_MACROS -D__STDC_LIMIT_MACROS -I/disk0/scratch/smonsees/yocto/workspace_1/builds2/sbcb-default/tmp/work/x86_64-linux/intel-graphics-compiler-native/1.0.11-r0/git/IGC/WrapperLLVM/include -IIGC/autogen -I/disk0/scratch/smonsees/yocto/workspace_1/builds2/sbcb-default/tmp/work/x86_64-linux/intel-graphics-compiler-native/1.0.11-r0/git/IGC -I/disk0/scratch/smonsees/yocto/workspace_1/builds2/sbcb-default/tmp/work/x86_64-linux/intel-graphics-compiler-native/1.0.11-r0/git/IGC/common -I/disk0/scratch/smonsees/yocto/workspace_1/builds2/sbcb-default/tmp/work/x86_64-linux/intel-graphics-compiler-native/1.0.11-r0/git/IGC/.. -I/disk0/scratch/smonsees/yocto/workspace_1/builds2/sbcb-default/tmp/work/x86_64-linux/intel-graphics-compiler-native/1.0.11-r0/git/IGC/../Common -I/disk0/scratch/smonsees/yocto/workspace_1/builds2/sbcb-default/tmp/work/x86_64-linux/intel-graphics-compiler-native/1.0.11-r0/git/IGC/../3d/common -I/disk0/scratch/smonsees/yocto/workspace_1/builds2/sbcb-default/tmp/work/x86_64-linux/intel-graphics-compiler-native/1.0.11-r0/git/IGC/../inc -I/disk0/scratch/smonsees/yocto/workspace_1/builds2/sbcb-default/tmp/work/x86_64-linux/intel-graphics-compiler-native/1.0.11-r0/git/IGC/../inc/common -I/disk0/scratch/smonsees/yocto/workspace_1/builds2/sbcb-default/tmp/work/x86_64-linux/intel-graphics-compiler-native/1.0.11-r0/git/IGC/../inc/common/Compiler -I/disk0/scratch/smonsees/yocto/workspace_1/builds2/sbcb-default/tmp/work/x86_64-linux/intel-graphics-compiler-native/1.0.11-r0/git/IGC/../inc/common/Compiler/API -I/disk0/scratch/smonsees/yocto/workspace_1/builds2/sbcb-default/tmp/work/x86_64-linux/intel-graphics-compiler-native/1.0.11-r0/git/IGC/../visa/include -IIGC/Release -I/disk0/scratch/smonsees/yocto/workspace_1/builds2/sbcb-default/tmp/work/x86_64-linux/intel-graphics-compiler-native/1.0.11-r0/git/IGC/AdaptorOCL/ocl_igc_shared/executable_format -I/disk0/scratch/smonsees/yocto/workspace_1/builds2/sbcb-default/tmp/work/x86_64-linux/intel-graphics-compiler-native/1.0.11-r0/git/IGC/AdaptorOCL -I/disk0/scratch/smonsees/yocto/workspace_1/builds2/sbcb-default/tmp/work/x86_64-linux/intel-graphics-compiler-native/1.0.11-r0/git/IGC/../inc/common/Compiler/common -I/disk0/scratch/smonsees/yocto/workspace_1/builds2/sbcb-default/tmp/work/x86_64-linux/intel-graphics-compiler-native/1.0.11-r0/git/IGC/AdaptorOCL/cif/cif/.. -I/disk0/scratch/smonsees/yocto/workspace_1/builds2/sbcb-default/tmp/work/x86_64-linux/intel-graphics-compiler-native/1.0.11-r0/git/IGC/GenISAIntrinsics -isystem/disk0/scratch/smonsees/yocto/workspace_1/builds2/sbcb-default/tmp/work/x86_64-linux/intel-graphics-compiler-native/1.0.11-r0/recipe-sysroot-native/usr/include -pipe -fno-exceptions -fdata-sections -ffunction-sections -O2 -fmessage-length=0 -march=corei7 -mstackrealign -fms-extensions -Werror -Wno-unused-parameter -Wno-missing-field-initializers -Wwrite-strings -Wno-long-long -Wswitch -Wno-sign-compare -Wno-unused-result -Wno-enum-compare -Wno-type-limits -Wno-ignored-qualifiers -Wformat -Wformat-security -Wno-extra -Wno-write-strings -finline -fno-strict-aliasing -msse -msse2 -msse3 -mssse3 -msse4 -msse4.1 -msse4.2 -Wno-unknown-pragmas -fPIC -D_FORTIFY_SOURCE=2 -fstack-protector -finline-functions -funswitch-loops -Wno-maybe-uninitialized -lrt -fno-rtti -fvisibility=hidden -fvisibility-inlines-hidden -std=c++14 -DNDEBUG -g -std=gnu++1y -MD -MT IGC/GenISAIntrinsics/CMakeFiles/GenISAIntrinsics.dir/GenIntrinsics.cpp.o -MF IGC/GenISAIntrinsics/CMakeFiles/GenISAIntrinsics.dir/GenIntrinsics.cpp.o.d -o IGC/GenISAIntrinsics/CMakeFiles/GenISAIntrinsics.dir/GenIntrinsics.cpp.o -c /disk0/scratch/smonsees/yocto/workspace_1/builds2/sbcb-default/tmp/work/x86_64-linux/intel-graphics-compiler-native/1.0.11-r0/git/IGC/GenISAIntrinsics/GenIntrinsics.cpp
FAILED: IGC/GenISAIntrinsics/CMakeFiles/GenISAIntrinsics.dir/GenIntrinsics.cpp.o
/disk0/scratch/smonsees/yocto/workspace_1/builds2/sbcb-default/tmp/hosttools/g++ -DCL_KHR_FP64_EXT -DGHAL3D=USC -DICBE_LINUX -DIGC_CMAKE -DIGC_EXPORTS=1 -DIGC_SPIRV_ENABLED -DINSIDE_PLUGIN -DISTDLIB_UMD -DLINUX -DNDEBUG -DNOMINMAX -DSTD_CALL -DUSC_EXPORTS=1 -DUSE_MMX -DUSE_SSE -DUSE_SSE2 -DUSE_SSE3 -DUSE_SSSE3 -D_AMD64_ -D_COMPILER_DLL_ -D_CRT_SECURE_NO_WARNINGS -D_HAS_EXCEPTIONS=0 -D_IGC_ -D_SCL_SECURE_NO_WARNINGS -D__STDC_CONSTANT_MACROS -D__STDC_LIMIT_MACROS -I/disk0/scratch/smonsees/yocto/workspace_1/builds2/sbcb-default/tmp/work/x86_64-linux/intel-graphics-compiler-native/1.0.11-r0/git/IGC/WrapperLLVM/include -IIGC/autogen -I/disk0/scratch/smonsees/yocto/workspace_1/builds2/sbcb-default/tmp/work/x86_64-linux/intel-graphics-compiler-native/1.0.11-r0/git/IGC -I/disk0/scratch/smonsees/yocto/workspace_1/builds2/sbcb-default/tmp/work/x86_64-linux/intel-graphics-compiler-native/1.0.11-r0/git/IGC/common -I/disk0/scratch/smonsees/yocto/workspace_1/builds2/sbcb-default/tmp/work/x86_64-linux/intel-graphics-compiler-native/1.0.11-r0/git/IGC/.. -I/disk0/scratch/smonsees/yocto/workspace_1/builds2/sbcb-default/tmp/work/x86_64-linux/intel-graphics-compiler-native/1.0.11-r0/git/IGC/../Common -I/disk0/scratch/smonsees/yocto/workspace_1/builds2/sbcb-default/tmp/work/x86_64-linux/intel-graphics-compiler-native/1.0.11-r0/git/IGC/../3d/common -I/disk0/scratch/smonsees/yocto/workspace_1/builds2/sbcb-default/tmp/work/x86_64-linux/intel-graphics-compiler-native/1.0.11-r0/git/IGC/../inc -I/disk0/scratch/smonsees/yocto/workspace_1/builds2/sbcb-default/tmp/work/x86_64-linux/intel-graphics-compiler-native/1.0.11-r0/git/IGC/../inc/common -I/disk0/scratch/smonsees/yocto/workspace_1/builds2/sbcb-default/tmp/work/x86_64-linux/intel-graphics-compiler-native/1.0.11-r0/git/IGC/../inc/common/Compiler -I/disk0/scratch/smonsees/yocto/workspace_1/builds2/sbcb-default/tmp/work/x86_64-linux/intel-graphics-compiler-native/1.0.11-r0/git/IGC/../inc/common/Compiler/API -I/disk0/scratch/smonsees/yocto/workspace_1/builds2/sbcb-default/tmp/work/x86_64-linux/intel-graphics-compiler-native/1.0.11-r0/git/IGC/../visa/include -IIGC/Release -I/disk0/scratch/smonsees/yocto/workspace_1/builds2/sbcb-default/tmp/work/x86_64-linux/intel-graphics-compiler-native/1.0.11-r0/git/IGC/AdaptorOCL/ocl_igc_shared/executable_format -I/disk0/scratch/smonsees/yocto/workspace_1/builds2/sbcb-default/tmp/work/x86_64-linux/intel-graphics-compiler-native/1.0.11-r0/git/IGC/AdaptorOCL -I/disk0/scratch/smonsees/yocto/workspace_1/builds2/sbcb-default/tmp/work/x86_64-linux/intel-graphics-compiler-native/1.0.11-r0/git/IGC/../inc/common/Compiler/common -I/disk0/scratch/smonsees/yocto/workspace_1/builds2/sbcb-default/tmp/work/x86_64-linux/intel-graphics-compiler-native/1.0.11-r0/git/IGC/AdaptorOCL/cif/cif/.. -I/disk0/scratch/smonsees/yocto/workspace_1/builds2/sbcb-default/tmp/work/x86_64-linux/intel-graphics-compiler-native/1.0.11-r0/git/IGC/GenISAIntrinsics -isystem/disk0/scratch/smonsees/yocto/workspace_1/builds2/sbcb-default/tmp/work/x86_64-linux/intel-graphics-compiler-native/1.0.11-r0/recipe-sysroot-native/usr/include -pipe -fno-exceptions -fdata-sections -ffunction-sections -O2 -fmessage-length=0 -march=corei7 -mstackrealign -fms-extensions -Werror -Wno-unused-parameter -Wno-missing-field-initializers -Wwrite-strings -Wno-long-long -Wswitch -Wno-sign-compare -Wno-unused-result -Wno-enum-compare -Wno-type-limits -Wno-ignored-qualifiers -Wformat -Wformat-security -Wno-extra -Wno-write-strings -finline -fno-strict-aliasing -msse -msse2 -msse3 -mssse3 -msse4 -msse4.1 -msse4.2 -Wno-unknown-pragmas -fPIC -D_FORTIFY_SOURCE=2 -fstack-protector -finline-functions -funswitch-loops -Wno-maybe-uninitialized -lrt -fno-rtti -fvisibility=hidden -fvisibility-inlines-hidden -std=c++14 -DNDEBUG -g -std=gnu++1y -MD -MT IGC/GenISAIntrinsics/CMakeFiles/GenISAIntrinsics.dir/GenIntrinsics.cpp.o -MF IGC/GenISAIntrinsics/CMakeFiles/GenISAIntrinsics.dir/GenIntrinsics.cpp.o.d -o IGC/GenISAIntrinsics/CMakeFiles/GenISAIntrinsics.dir/GenIntrinsics.cpp.o -c /disk0/scratch/smonsees/yocto/workspace_1/builds2/sbcb-default/tmp/work/x86_64-linux/intel-graphics-compiler-native/1.0.11-r0/git/IGC/GenISAIntrinsics/GenIntrinsics.cpp
g++: error: unrecognized command line option ‘-std=c++14’
[6/565] cd /disk0/scratch/smonsees/yocto/workspace_1/builds2/sbcb-default/tmp/work/x86_64-linux/intel-graphics-compiler-native/1.0.11-r0/git/visa && /disk0/scratch/smonsees/yocto/workspace_1/builds2/sbcb-default/tmp/work/x86_64-linux/intel-graphics-compiler-native/1.0.11-r0/recipe-sysroot-native/usr/bin/bison -vt -p CISA -d -o /disk0/scratch/smonsees/yocto/workspace_1/builds2/sbcb-default/tmp/work/x86_64-linux/intel-graphics-compiler-native/1.0.11-r0/build/IGC/visa/CISA.tab.cpp CISA.y
CISA.y:84.1-14: warning: deprecated directive, use ‘%define parse.error verbose’ [-Wdeprecated]
84 | %error-verbose
| ^~~~~~~~~~~~~~
CISA.y: warning: 1 nonterminal useless in grammar [-Wother]
CISA.y: warning: 1 rule useless in grammar [-Wother]
CISA.y:1478.1-16: warning: nonterminal useless in grammar: VecSrcOpndSimple [-Wother]
1478 | VecSrcOpndSimple : VAR TwoDimOffset
| ^~~~~~~~~~~~~~~~
CISA.y: warning: 140 shift/reduce conflicts [-Wconflicts-sr]
CISA.y: warning: 20 reduce/reduce conflicts [-Wconflicts-rr]
CISA.y: warning: fix-its can be applied. Rerun with option '--update'. [-Wother]
[7/565] cd /disk0/scratch/smonsees/yocto/workspace_1/builds2/sbcb-default/tmp/work/x86_64-linux/intel-graphics-compiler-native/1.0.11-r0/build/IGC/BiFModule && /disk0/scratch/smonsees/yocto/workspace_1/builds2/sbcb-default/tmp/work/x86_64-linux/intel-graphics-compiler-native/1.0.11-r0/recipe-sysroot-native/usr/bin/cmake -E make_directory /disk0/scratch/smonsees/yocto/workspace_1/builds2/sbcb-default/tmp/work/x86_64-linux/intel-graphics-compiler-native/1.0.11-r0/build/IGC/Release/bif/. && /disk0/scratch/smonsees/yocto/workspace_1/builds2/sbcb-default/tmp/work/x86_64-linux/intel-graphics-compiler-native/1.0.11-r0/recipe-sysroot-native/usr/bin/clang-9 -cc1 -x cl -fblocks -fpreserve-vec3-type -opencl-builtins -triple=spir64 -w -emit-llvm-bc -o /disk0/scratch/smonsees/yocto/workspace_1/builds2/sbcb-default/tmp/work/x86_64-linux/intel-graphics-compiler-native/1.0.11-r0/build/IGC/Release/bif/./IBiF_spirv_size_t_64.bc_pointersize__cl__0.bc.tmp -include /disk0/scratch/smonsees/yocto/workspace_1/builds2/sbcb-default/tmp/work/x86_64-linux/intel-graphics-compiler-native/1.0.11-r0/build/IGC/Release/bif/./opencl_cth.h -I /disk0/scratch/smonsees/yocto/workspace_1/builds2/sbcb-default/tmp/work/x86_64-linux/intel-graphics-compiler-native/1.0.11-r0/git/IGC/BiFModule/Languages/OpenCL -I /disk0/scratch/smonsees/yocto/workspace_1/builds2/sbcb-default/tmp/work/x86_64-linux/intel-graphics-compiler-native/1.0.11-r0/git/IGC/BiFModule/Languages/OpenCL/PointerSize -I /disk0/scratch/smonsees/yocto/workspace_1/builds2/sbcb-default/tmp/work/x86_64-linux/intel-graphics-compiler-native/1.0.11-r0/git/IGC/BiFModule/Headers -I /disk0/scratch/smonsees/yocto/workspace_1/builds2/sbcb-default/tmp/work/x86_64-linux/intel-graphics-compiler-native/1.0.11-r0/git/IGC/BiFModule/../AdaptorOCL/ocl_igc_shared/device_enqueue -D__EXECUTION_MODEL_DEBUG=1 -D__OPENCL_C_VERSION__=200 -D__IGC_BUILD__ -Dcl_khr_f16 -Dcl_khrfp64 -Dcl_khr_gl_msaa_sharing -Dcl_khr_mipmap_image -Dcl_khr_depth_images -Dcl_intel_subgroups_short -Dcl_intel_subgroups_char -Dcl_intel_subgroups_long -Dcl_intel_64bit_global_atomics_placeholder -D__VME_TYPES_DEFINED__ -finclude-default-header -cl-std=CL2.0 /disk0/scratch/smonsees/yocto/workspace_1/builds2/sbcb-default/tmp/work/x86_64-linux/intel-graphics-compiler-native/1.0.11-r0/git/IGC/BiFModule/Implementation/pointersize.cl
[8/565] cd /disk0/scratch/smonsees/yocto/workspace_1/builds2/sbcb-default/tmp/work/x86_64-linux/intel-graphics-compiler-native/1.0.11-r0/build/IGC/BiFModule && /disk0/scratch/smonsees/yocto/workspace_1/builds2/sbcb-default/tmp/work/x86_64-linux/intel-graphics-compiler-native/1.0.11-r0/recipe-sysroot-native/usr/bin/cmake -E make_directory /disk0/scratch/smonsees/yocto/workspace_1/builds2/sbcb-default/tmp/work/x86_64-linux/intel-graphics-compiler-native/1.0.11-r0/build/IGC/Release/bif/. && /disk0/scratch/smonsees/yocto/workspace_1/builds2/sbcb-default/tmp/work/x86_64-linux/intel-graphics-compiler-native/1.0.11-r0/recipe-sysroot-native/usr/bin/clang-9 -cc1 -x cl -fblocks -fpreserve-vec3-type -opencl-builtins -triple=spir64 -w -emit-llvm-bc -o /disk0/scratch/smonsees/yocto/workspace_1/builds2/sbcb-default/tmp/work/x86_64-linux/intel-graphics-compiler-native/1.0.11-r0/build/IGC/Release/bif/./IBiF_Impl_int_spirv.bc_IBiF_Impl__cl__0.bc.tmp -include /disk0/scratch/smonsees/yocto/workspace_1/builds2/sbcb-default/tmp/work/x86_64-linux/intel-graphics-compiler-native/1.0.11-r0/build/IGC/Release/bif/./opencl_cth.h -I /disk0/scratch/smonsees/yocto/workspace_1/builds2/sbcb-default/tmp/work/x86_64-linux/intel-graphics-compiler-native/1.0.11-r0/git/IGC/BiFModule/Implementation -I /disk0/scratch/smonsees/yocto/workspace_1/builds2/sbcb-default/tmp/work/x86_64-linux/intel-graphics-compiler-native/1.0.11-r0/git/IGC/BiFModule/Headers -I /disk0/scratch/smonsees/yocto/workspace_1/builds2/sbcb-default/tmp/work/x86_64-linux/intel-graphics-compiler-native/1.0.11-r0/git/IGC/BiFModule/../AdaptorOCL/ocl_igc_interface/device_enqueue -D__EXECUTION_MODEL_DEBUG=1 -D__OPENCL_C_VERSION__=200 -D__IGC_BUILD__ -Dcl_khr_f16 -Dcl_khrfp64 -Dcl_khr_gl_msaa_sharing -Dcl_khr_mipmap_image -Dcl_khr_depth_images -Dcl_intel_subgroups_short -Dcl_intel_subgroups_char -Dcl_intel_subgroups_long -Dcl_intel_64bit_global_atomics_placeholder -D__VME_TYPES_DEFINED__ -finclude-default-header -cl-std=CL2.0 /disk0/scratch/smonsees/yocto/workspace_1/builds2/sbcb-default/tmp/work/x86_64-linux/intel-graphics-compiler-native/1.0.11-r0/git/IGC/BiFModule/Implementation/IBiF_Impl.cl
ninja: build stopped: subcommand failed.
WARNING: /disk0/scratch/smonsees/yocto/workspace_1/builds2/sbcb-default/tmp/work/x86_64-linux/intel-graphics-compiler-native/1.0.11-r0/temp/run.do_compile.26870:1 exit 1 from 'VERBOSE=1 cmake --build /disk0/scratch/smonsees/yocto/workspace_1/builds2/sbcb-default/tmp/work/x86_64-linux/intel-graphics-compiler-native/1.0.11-r0/build --target all -- -j 4'

ERROR: Logfile of failure stored in: /disk0/scratch/smonsees/yocto/workspace_1/builds2/sbcb-default/tmp/work/x86_64-linux/intel-graphics-compiler-native/1.0.11-r0/temp/log.do_compile.26870
Log data follows:
| DEBUG: Executing shell function do_compile
| NOTE: VERBOSE=1 cmake --build /disk0/scratch/smonsees/yocto/workspace_1/builds2/sbcb-default/tmp/work/x86_64-linux/intel-graphics-compiler-native/1.0.11-r0/build --target all -- -j 4
| [1/565] cd /disk0/scratch/smonsees/yocto/workspace_1/builds2/sbcb-default/tmp/work/x86_64-linux/intel-graphics-compiler-native/1.0.11-r0/git/visa && /disk0/scratch/smonsees/yocto/workspace_1/builds2/sbcb-default/tmp/work/x86_64-linux/intel-graphics-compiler-native/1.0.11-r0/recipe-sysroot-native/usr/bin/flex -PCISA -o/disk0/scratch/smonsees/yocto/workspace_1/builds2/sbcb-default/tmp/work/x86_64-linux/intel-graphics-compiler-native/1.0.11-r0/build/IGC/visa/lex.CISA.cpp CISA.l
| CISA.l:486: warning, rule cannot be matched
| [2/565] cd /disk0/scratch/smonsees/yocto/workspace_1/builds2/sbcb-default/tmp/work/x86_64-linux/intel-graphics-compiler-native/1.0.11-r0/build/IGC/BiFModule && /disk0/scratch/smonsees/yocto/workspace_1/builds2/sbcb-default/tmp/work/x86_64-linux/intel-graphics-compiler-native/1.0.11-r0/recipe-sysroot-native/usr/bin/cmake -E make_directory /disk0/scratch/smonsees/yocto/workspace_1/builds2/sbcb-default/tmp/work/x86_64-linux/intel-graphics-compiler-native/1.0.11-r0/build/IGC/Release/bif/. && /disk0/scratch/smonsees/yocto/workspace_1/builds2/sbcb-default/tmp/hosttools/python3 /disk0/scratch/smonsees/yocto/workspace_1/builds2/sbcb-default/tmp/work/x86_64-linux/intel-graphics-compiler-native/1.0.11-r0/git/IGC/BiFModule/concat.py -new /disk0/scratch/smonsees/yocto/workspace_1/builds2/sbcb-default/tmp/work/x86_64-linux/intel-graphics-compiler-native/1.0.11-r0/build/IGC/Release/bif/./opencl_cth.h /disk0/scratch/smonsees/yocto/workspace_1/builds2/sbcb-default/tmp/work/x86_64-linux/intel-graphics-compiler-native/1.0.11-r0/git/IGC/BiFModule/Languages/OpenCL/opencl_cth_released.h /disk0/scratch/smonsees/yocto/workspace_1/builds2/sbcb-default/tmp/work/x86_64-linux/intel-graphics-compiler-native/1.0.11-r0/git/IGC/BiFModule/Languages/OpenCL/PreRelease/opencl_cth_pre_release.h
| [3/565] cd /disk0/scratch/smonsees/yocto/workspace_1/builds2/sbcb-default/tmp/work/x86_64-linux/intel-graphics-compiler-native/1.0.11-r0/build/IGC/autogen/MDAutogen && /disk0/scratch/smonsees/yocto/workspace_1/builds2/sbcb-default/tmp/hosttools/python3 /disk0/scratch/smonsees/yocto/workspace_1/builds2/sbcb-default/tmp/work/x86_64-linux/intel-graphics-compiler-native/1.0.11-r0/git/IGC/common/autogen.py /disk0/scratch/smonsees/yocto/workspace_1/builds2/sbcb-default/tmp/work/x86_64-linux/intel-graphics-compiler-native/1.0.11-r0/git/IGC/common/MDFrameWork.h /disk0/scratch/smonsees/yocto/workspace_1/builds2/sbcb-default/tmp/work/x86_64-linux/intel-graphics-compiler-native/1.0.11-r0/build/IGC/autogen/MDNodeFunctions.gen
| [4/565] cd /disk0/scratch/smonsees/yocto/workspace_1/builds2/sbcb-default/tmp/work/x86_64-linux/intel-graphics-compiler-native/1.0.11-r0/build/IGC/GenISAIntrinsics && /disk0/scratch/smonsees/yocto/workspace_1/builds2/sbcb-default/tmp/hosttools/python3 /disk0/scratch/smonsees/yocto/workspace_1/builds2/sbcb-default/tmp/work/x86_64-linux/intel-graphics-compiler-native/1.0.11-r0/git/IGC/GenISAIntrinsics/Intrinsics.py Intrinsic_definitions.py /disk0/scratch/smonsees/yocto/workspace_1/builds2/sbcb-default/tmp/work/x86_64-linux/intel-graphics-compiler-native/1.0.11-r0/build/IGC/Release/IntrinsicGenISA.gen
| [5/565] /disk0/scratch/smonsees/yocto/workspace_1/builds2/sbcb-default/tmp/hosttools/g++ -DCL_KHR_FP64_EXT -DGHAL3D=USC -DICBE_LINUX -DIGC_CMAKE -DIGC_EXPORTS=1 -DIGC_SPIRV_ENABLED -DINSIDE_PLUGIN -DISTDLIB_UMD -DLINUX -DNDEBUG -DNOMINMAX -DSTD_CALL -DUSC_EXPORTS=1 -DUSE_MMX -DUSE_SSE -DUSE_SSE2 -DUSE_SSE3 -DUSE_SSSE3 -D_AMD64_ -D_COMPILER_DLL_ -D_CRT_SECURE_NO_WARNINGS -D_HAS_EXCEPTIONS=0 -D_IGC_ -D_SCL_SECURE_NO_WARNINGS -D__STDC_CONSTANT_MACROS -D__STDC_LIMIT_MACROS -I/disk0/scratch/smonsees/yocto/workspace_1/builds2/sbcb-default/tmp/work/x86_64-linux/intel-graphics-compiler-native/1.0.11-r0/git/IGC/WrapperLLVM/include -IIGC/autogen -I/disk0/scratch/smonsees/yocto/workspace_1/builds2/sbcb-default/tmp/work/x86_64-linux/intel-graphics-compiler-native/1.0.11-r0/git/IGC -I/disk0/scratch/smonsees/yocto/workspace_1/builds2/sbcb-default/tmp/work/x86_64-linux/intel-graphics-compiler-native/1.0.11-r0/git/IGC/common -I/disk0/scratch/smonsees/yocto/workspace_1/builds2/sbcb-default/tmp/work/x86_64-linux/intel-graphics-compiler-native/1.0.11-r0/git/IGC/.. -I/disk0/scratch/smonsees/yocto/workspace_1/builds2/sbcb-default/tmp/work/x86_64-linux/intel-graphics-compiler-native/1.0.11-r0/git/IGC/../Common -I/disk0/scratch/smonsees/yocto/workspace_1/builds2/sbcb-default/tmp/work/x86_64-linux/intel-graphics-compiler-native/1.0.11-r0/git/IGC/../3d/common -I/disk0/scratch/smonsees/yocto/workspace_1/builds2/sbcb-default/tmp/work/x86_64-linux/intel-graphics-compiler-native/1.0.11-r0/git/IGC/../inc -I/disk0/scratch/smonsees/yocto/workspace_1/builds2/sbcb-default/tmp/work/x86_64-linux/intel-graphics-compiler-native/1.0.11-r0/git/IGC/../inc/common -I/disk0/scratch/smonsees/yocto/workspace_1/builds2/sbcb-default/tmp/work/x86_64-linux/intel-graphics-compiler-native/1.0.11-r0/git/IGC/../inc/common/Compiler -I/disk0/scratch/smonsees/yocto/workspace_1/builds2/sbcb-default/tmp/work/x86_64-linux/intel-graphics-compiler-native/1.0.11-r0/git/IGC/../inc/common/Compiler/API -I/disk0/scratch/smonsees/yocto/workspace_1/builds2/sbcb-default/tmp/work/x86_64-linux/intel-graphics-compiler-native/1.0.11-r0/git/IGC/../visa/include -IIGC/Release -I/disk0/scratch/smonsees/yocto/workspace_1/builds2/sbcb-default/tmp/work/x86_64-linux/intel-graphics-compiler-native/1.0.11-r0/git/IGC/AdaptorOCL/ocl_igc_shared/executable_format -I/disk0/scratch/smonsees/yocto/workspace_1/builds2/sbcb-default/tmp/work/x86_64-linux/intel-graphics-compiler-native/1.0.11-r0/git/IGC/AdaptorOCL -I/disk0/scratch/smonsees/yocto/workspace_1/builds2/sbcb-default/tmp/work/x86_64-linux/intel-graphics-compiler-native/1.0.11-r0/git/IGC/../inc/common/Compiler/common -I/disk0/scratch/smonsees/yocto/workspace_1/builds2/sbcb-default/tmp/work/x86_64-linux/intel-graphics-compiler-native/1.0.11-r0/git/IGC/AdaptorOCL/cif/cif/.. -I/disk0/scratch/smonsees/yocto/workspace_1/builds2/sbcb-default/tmp/work/x86_64-linux/intel-graphics-compiler-native/1.0.11-r0/git/IGC/GenISAIntrinsics -isystem/disk0/scratch/smonsees/yocto/workspace_1/builds2/sbcb-default/tmp/work/x86_64-linux/intel-graphics-compiler-native/1.0.11-r0/recipe-sysroot-native/usr/include -pipe -fno-exceptions -fdata-sections -ffunction-sections -O2 -fmessage-length=0 -march=corei7 -mstackrealign -fms-extensions -Werror -Wno-unused-parameter -Wno-missing-field-initializers -Wwrite-strings -Wno-long-long -Wswitch -Wno-sign-compare -Wno-unused-result -Wno-enum-compare -Wno-type-limits -Wno-ignored-qualifiers -Wformat -Wformat-security -Wno-extra -Wno-write-strings -finline -fno-strict-aliasing -msse -msse2 -msse3 -mssse3 -msse4 -msse4.1 -msse4.2 -Wno-unknown-pragmas -fPIC -D_FORTIFY_SOURCE=2 -fstack-protector -finline-functions -funswitch-loops -Wno-maybe-uninitialized -lrt -fno-rtti -fvisibility=hidden -fvisibility-inlines-hidden -std=c++14 -DNDEBUG -g -std=gnu++1y -MD -MT IGC/GenISAIntrinsics/CMakeFiles/GenISAIntrinsics.dir/GenIntrinsics.cpp.o -MF IGC/GenISAIntrinsics/CMakeFiles/GenISAIntrinsics.dir/GenIntrinsics.cpp.o.d -o IGC/GenISAIntrinsics/CMakeFiles/GenISAIntrinsics.dir/GenIntrinsics.cpp.o -c /disk0/scratch/smonsees/yocto/workspace_1/builds2/sbcb-default/tmp/work/x86_64-linux/intel-graphics-compiler-native/1.0.11-r0/git/IGC/GenISAIntrinsics/GenIntrinsics.cpp
| FAILED: IGC/GenISAIntrinsics/CMakeFiles/GenISAIntrinsics.dir/GenIntrinsics.cpp.o
| /disk0/scratch/smonsees/yocto/workspace_1/builds2/sbcb-default/tmp/hosttools/g++ -DCL_KHR_FP64_EXT -DGHAL3D=USC -DICBE_LINUX -DIGC_CMAKE -DIGC_EXPORTS=1 -DIGC_SPIRV_ENABLED -DINSIDE_PLUGIN -DISTDLIB_UMD -DLINUX -DNDEBUG -DNOMINMAX -DSTD_CALL -DUSC_EXPORTS=1 -DUSE_MMX -DUSE_SSE -DUSE_SSE2 -DUSE_SSE3 -DUSE_SSSE3 -D_AMD64_ -D_COMPILER_DLL_ -D_CRT_SECURE_NO_WARNINGS -D_HAS_EXCEPTIONS=0 -D_IGC_ -D_SCL_SECURE_NO_WARNINGS -D__STDC_CONSTANT_MACROS -D__STDC_LIMIT_MACROS -I/disk0/scratch/smonsees/yocto/workspace_1/builds2/sbcb-default/tmp/work/x86_64-linux/intel-graphics-compiler-native/1.0.11-r0/git/IGC/WrapperLLVM/include -IIGC/autogen -I/disk0/scratch/smonsees/yocto/workspace_1/builds2/sbcb-default/tmp/work/x86_64-linux/intel-graphics-compiler-native/1.0.11-r0/git/IGC -I/disk0/scratch/smonsees/yocto/workspace_1/builds2/sbcb-default/tmp/work/x86_64-linux/intel-graphics-compiler-native/1.0.11-r0/git/IGC/common -I/disk0/scratch/smonsees/yocto/workspace_1/builds2/sbcb-default/tmp/work/x86_64-linux/intel-graphics-compiler-native/1.0.11-r0/git/IGC/.. -I/disk0/scratch/smonsees/yocto/workspace_1/builds2/sbcb-default/tmp/work/x86_64-linux/intel-graphics-compiler-native/1.0.11-r0/git/IGC/../Common -I/disk0/scratch/smonsees/yocto/workspace_1/builds2/sbcb-default/tmp/work/x86_64-linux/intel-graphics-compiler-native/1.0.11-r0/git/IGC/../3d/common -I/disk0/scratch/smonsees/yocto/workspace_1/builds2/sbcb-default/tmp/work/x86_64-linux/intel-graphics-compiler-native/1.0.11-r0/git/IGC/../inc -I/disk0/scratch/smonsees/yocto/workspace_1/builds2/sbcb-default/tmp/work/x86_64-linux/intel-graphics-compiler-native/1.0.11-r0/git/IGC/../inc/common -I/disk0/scratch/smonsees/yocto/workspace_1/builds2/sbcb-default/tmp/work/x86_64-linux/intel-graphics-compiler-native/1.0.11-r0/git/IGC/../inc/common/Compiler -I/disk0/scratch/smonsees/yocto/workspace_1/builds2/sbcb-default/tmp/work/x86_64-linux/intel-graphics-compiler-native/1.0.11-r0/git/IGC/../inc/common/Compiler/API -I/disk0/scratch/smonsees/yocto/workspace_1/builds2/sbcb-default/tmp/work/x86_64-linux/intel-graphics-compiler-native/1.0.11-r0/git/IGC/../visa/include -IIGC/Release -I/disk0/scratch/smonsees/yocto/workspace_1/builds2/sbcb-default/tmp/work/x86_64-linux/intel-graphics-compiler-native/1.0.11-r0/git/IGC/AdaptorOCL/ocl_igc_shared/executable_format -I/disk0/scratch/smonsees/yocto/workspace_1/builds2/sbcb-default/tmp/work/x86_64-linux/intel-graphics-compiler-native/1.0.11-r0/git/IGC/AdaptorOCL -I/disk0/scratch/smonsees/yocto/workspace_1/builds2/sbcb-default/tmp/work/x86_64-linux/intel-graphics-compiler-native/1.0.11-r0/git/IGC/../inc/common/Compiler/common -I/disk0/scratch/smonsees/yocto/workspace_1/builds2/sbcb-default/tmp/work/x86_64-linux/intel-graphics-compiler-native/1.0.11-r0/git/IGC/AdaptorOCL/cif/cif/.. -I/disk0/scratch/smonsees/yocto/workspace_1/builds2/sbcb-default/tmp/work/x86_64-linux/intel-graphics-compiler-native/1.0.11-r0/git/IGC/GenISAIntrinsics -isystem/disk0/scratch/smonsees/yocto/workspace_1/builds2/sbcb-default/tmp/work/x86_64-linux/intel-graphics-compiler-native/1.0.11-r0/recipe-sysroot-native/usr/include -pipe -fno-exceptions -fdata-sections -ffunction-sections -O2 -fmessage-length=0 -march=corei7 -mstackrealign -fms-extensions -Werror -Wno-unused-parameter -Wno-missing-field-initializers -Wwrite-strings -Wno-long-long -Wswitch -Wno-sign-compare -Wno-unused-result -Wno-enum-compare -Wno-type-limits -Wno-ignored-qualifiers -Wformat -Wformat-security -Wno-extra -Wno-write-strings -finline -fno-strict-aliasing -msse -msse2 -msse3 -mssse3 -msse4 -msse4.1 -msse4.2 -Wno-unknown-pragmas -fPIC -D_FORTIFY_SOURCE=2 -fstack-protector -finline-functions -funswitch-loops -Wno-maybe-uninitialized -lrt -fno-rtti -fvisibility=hidden -fvisibility-inlines-hidden -std=c++14 -DNDEBUG -g -std=gnu++1y -MD -MT IGC/GenISAIntrinsics/CMakeFiles/GenISAIntrinsics.dir/GenIntrinsics.cpp.o -MF IGC/GenISAIntrinsics/CMakeFiles/GenISAIntrinsics.dir/GenIntrinsics.cpp.o.d -o IGC/GenISAIntrinsics/CMakeFiles/GenISAIntrinsics.dir/GenIntrinsics.cpp.o -c /disk0/scratch/smonsees/yocto/workspace_1/builds2/sbcb-default/tmp/work/x86_64-linux/intel-graphics-compiler-native/1.0.11-r0/git/IGC/GenISAIntrinsics/GenIntrinsics.cpp
| g++: error: unrecognized command line option ‘-std=c++14’
| [6/565] cd /disk0/scratch/smonsees/yocto/workspace_1/builds2/sbcb-default/tmp/work/x86_64-linux/intel-graphics-compiler-native/1.0.11-r0/git/visa && /disk0/scratch/smonsees/yocto/workspace_1/builds2/sbcb-default/tmp/work/x86_64-linux/intel-graphics-compiler-native/1.0.11-r0/recipe-sysroot-native/usr/bin/bison -vt -p CISA -d -o /disk0/scratch/smonsees/yocto/workspace_1/builds2/sbcb-default/tmp/work/x86_64-linux/intel-graphics-compiler-native/1.0.11-r0/build/IGC/visa/CISA.tab.cpp CISA.y
| CISA.y:84.1-14: warning: deprecated directive, use ‘%define parse.error verbose’ [-Wdeprecated]
| 84 | %error-verbose
| | ^~~~~~~~~~~~~~
| CISA.y: warning: 1 nonterminal useless in grammar [-Wother]
| CISA.y: warning: 1 rule useless in grammar [-Wother]
| CISA.y:1478.1-16: warning: nonterminal useless in grammar: VecSrcOpndSimple [-Wother]
| 1478 | VecSrcOpndSimple : VAR TwoDimOffset
| | ^~~~~~~~~~~~~~~~
| CISA.y: warning: 140 shift/reduce conflicts [-Wconflicts-sr]
| CISA.y: warning: 20 reduce/reduce conflicts [-Wconflicts-rr]
| CISA.y: warning: fix-its can be applied. Rerun with option '--update'. [-Wother]
| [7/565] cd /disk0/scratch/smonsees/yocto/workspace_1/builds2/sbcb-default/tmp/work/x86_64-linux/intel-graphics-compiler-native/1.0.11-r0/build/IGC/BiFModule && /disk0/scratch/smonsees/yocto/workspace_1/builds2/sbcb-default/tmp/work/x86_64-linux/intel-graphics-compiler-native/1.0.11-r0/recipe-sysroot-native/usr/bin/cmake -E make_directory /disk0/scratch/smonsees/yocto/workspace_1/builds2/sbcb-default/tmp/work/x86_64-linux/intel-graphics-compiler-native/1.0.11-r0/build/IGC/Release/bif/. && /disk0/scratch/smonsees/yocto/workspace_1/builds2/sbcb-default/tmp/work/x86_64-linux/intel-graphics-compiler-native/1.0.11-r0/recipe-sysroot-native/usr/bin/clang-9 -cc1 -x cl -fblocks -fpreserve-vec3-type -opencl-builtins -triple=spir64 -w -emit-llvm-bc -o /disk0/scratch/smonsees/yocto/workspace_1/builds2/sbcb-default/tmp/work/x86_64-linux/intel-graphics-compiler-native/1.0.11-r0/build/IGC/Release/bif/./IBiF_spirv_size_t_64.bc_pointersize__cl__0.bc.tmp -include /disk0/scratch/smonsees/yocto/workspace_1/builds2/sbcb-default/tmp/work/x86_64-linux/intel-graphics-compiler-native/1.0.11-r0/build/IGC/Release/bif/./opencl_cth.h -I /disk0/scratch/smonsees/yocto/workspace_1/builds2/sbcb-default/tmp/work/x86_64-linux/intel-graphics-compiler-native/1.0.11-r0/git/IGC/BiFModule/Languages/OpenCL -I /disk0/scratch/smonsees/yocto/workspace_1/builds2/sbcb-default/tmp/work/x86_64-linux/intel-graphics-compiler-native/1.0.11-r0/git/IGC/BiFModule/Languages/OpenCL/PointerSize -I /disk0/scratch/smonsees/yocto/workspace_1/builds2/sbcb-default/tmp/work/x86_64-linux/intel-graphics-compiler-native/1.0.11-r0/git/IGC/BiFModule/Headers -I /disk0/scratch/smonsees/yocto/workspace_1/builds2/sbcb-default/tmp/work/x86_64-linux/intel-graphics-compiler-native/1.0.11-r0/git/IGC/BiFModule/../AdaptorOCL/ocl_igc_shared/device_enqueue -D__EXECUTION_MODEL_DEBUG=1 -D__OPENCL_C_VERSION__=200 -D__IGC_BUILD__ -Dcl_khr_f16 -Dcl_khrfp64 -Dcl_khr_gl_msaa_sharing -Dcl_khr_mipmap_image -Dcl_khr_depth_images -Dcl_intel_subgroups_short -Dcl_intel_subgroups_char -Dcl_intel_subgroups_long -Dcl_intel_64bit_global_atomics_placeholder -D__VME_TYPES_DEFINED__ -finclude-default-header -cl-std=CL2.0 /disk0/scratch/smonsees/yocto/workspace_1/builds2/sbcb-default/tmp/work/x86_64-linux/intel-graphics-compiler-native/1.0.11-r0/git/IGC/BiFModule/Implementation/pointersize.cl
| [8/565] cd /disk0/scratch/smonsees/yocto/workspace_1/builds2/sbcb-default/tmp/work/x86_64-linux/intel-graphics-compiler-native/1.0.11-r0/build/IGC/BiFModule && /disk0/scratch/smonsees/yocto/workspace_1/builds2/sbcb-default/tmp/work/x86_64-linux/intel-graphics-compiler-native/1.0.11-r0/recipe-sysroot-native/usr/bin/cmake -E make_directory /disk0/scratch/smonsees/yocto/workspace_1/builds2/sbcb-default/tmp/work/x86_64-linux/intel-graphics-compiler-native/1.0.11-r0/build/IGC/Release/bif/. && /disk0/scratch/smonsees/yocto/workspace_1/builds2/sbcb-default/tmp/work/x86_64-linux/intel-graphics-compiler-native/1.0.11-r0/recipe-sysroot-native/usr/bin/clang-9 -cc1 -x cl -fblocks -fpreserve-vec3-type -opencl-builtins -triple=spir64 -w -emit-llvm-bc -o /disk0/scratch/smonsees/yocto/workspace_1/builds2/sbcb-default/tmp/work/x86_64-linux/intel-graphics-compiler-native/1.0.11-r0/build/IGC/Release/bif/./IBiF_Impl_int_spirv.bc_IBiF_Impl__cl__0.bc.tmp -include /disk0/scratch/smonsees/yocto/workspace_1/builds2/sbcb-default/tmp/work/x86_64-linux/intel-graphics-compiler-native/1.0.11-r0/build/IGC/Release/bif/./opencl_cth.h -I /disk0/scratch/smonsees/yocto/workspace_1/builds2/sbcb-default/tmp/work/x86_64-linux/intel-graphics-compiler-native/1.0.11-r0/git/IGC/BiFModule/Implementation -I /disk0/scratch/smonsees/yocto/workspace_1/builds2/sbcb-default/tmp/work/x86_64-linux/intel-graphics-compiler-native/1.0.11-r0/git/IGC/BiFModule/Headers -I /disk0/scratch/smonsees/yocto/workspace_1/builds2/sbcb-default/tmp/work/x86_64-linux/intel-graphics-compiler-native/1.0.11-r0/git/IGC/BiFModule/../AdaptorOCL/ocl_igc_interface/device_enqueue -D__EXECUTION_MODEL_DEBUG=1 -D__OPENCL_C_VERSION__=200 -D__IGC_BUILD__ -Dcl_khr_f16 -Dcl_khrfp64 -Dcl_khr_gl_msaa_sharing -Dcl_khr_mipmap_image -Dcl_khr_depth_images -Dcl_intel_subgroups_short -Dcl_intel_subgroups_char -Dcl_intel_subgroups_long -Dcl_intel_64bit_global_atomics_placeholder -D__VME_TYPES_DEFINED__ -finclude-default-header -cl-std=CL2.0 /disk0/scratch/smonsees/yocto/workspace_1/builds2/sbcb-default/tmp/work/x86_64-linux/intel-graphics-compiler-native/1.0.11-r0/git/IGC/BiFModule/Implementation/IBiF_Impl.cl
| ninja: build stopped: subcommand failed.
| WARNING: /disk0/scratch/smonsees/yocto/workspace_1/builds2/sbcb-default/tmp/work/x86_64-linux/intel-graphics-compiler-native/1.0.11-r0/temp/run.do_compile.26870:1 exit 1 from 'VERBOSE=1 cmake --build /disk0/scratch/smonsees/yocto/workspace_1/builds2/sbcb-default/tmp/work/x86_64-linux/intel-graphics-compiler-native/1.0.11-r0/build --target all -- -j 4'
| ERROR: Execution of '/disk0/scratch/smonsees/yocto/workspace_1/builds2/sbcb-default/tmp/work/x86_64-linux/intel-graphics-compiler-native/1.0.11-r0/temp/run.do_compile.26870' failed with exit code 1:
| [1/565] cd /disk0/scratch/smonsees/yocto/workspace_1/builds2/sbcb-default/tmp/work/x86_64-linux/intel-graphics-compiler-native/1.0.11-r0/git/visa && /disk0/scratch/smonsees/yocto/workspace_1/builds2/sbcb-default/tmp/work/x86_64-linux/intel-graphics-compiler-native/1.0.11-r0/recipe-sysroot-native/usr/bin/flex -PCISA -o/disk0/scratch/smonsees/yocto/workspace_1/builds2/sbcb-default/tmp/work/x86_64-linux/intel-graphics-compiler-native/1.0.11-r0/build/IGC/visa/lex.CISA.cpp CISA.l
| CISA.l:486: warning, rule cannot be matched
| [2/565] cd /disk0/scratch/smonsees/yocto/workspace_1/builds2/sbcb-default/tmp/work/x86_64-linux/intel-graphics-compiler-native/1.0.11-r0/build/IGC/BiFModule && /disk0/scratch/smonsees/yocto/workspace_1/builds2/sbcb-default/tmp/work/x86_64-linux/intel-graphics-compiler-native/1.0.11-r0/recipe-sysroot-native/usr/bin/cmake -E make_directory /disk0/scratch/smonsees/yocto/workspace_1/builds2/sbcb-default/tmp/work/x86_64-linux/intel-graphics-compiler-native/1.0.11-r0/build/IGC/Release/bif/. && /disk0/scratch/smonsees/yocto/workspace_1/builds2/sbcb-default/tmp/hosttools/python3 /disk0/scratch/smonsees/yocto/workspace_1/builds2/sbcb-default/tmp/work/x86_64-linux/intel-graphics-compiler-native/1.0.11-r0/git/IGC/BiFModule/concat.py -new /disk0/scratch/smonsees/yocto/workspace_1/builds2/sbcb-default/tmp/work/x86_64-linux/intel-graphics-compiler-native/1.0.11-r0/build/IGC/Release/bif/./opencl_cth.h /disk0/scratch/smonsees/yocto/workspace_1/builds2/sbcb-default/tmp/work/x86_64-linux/intel-graphics-compiler-native/1.0.11-r0/git/IGC/BiFModule/Languages/OpenCL/opencl_cth_released.h /disk0/scratch/smonsees/yocto/workspace_1/builds2/sbcb-default/tmp/work/x86_64-linux/intel-graphics-compiler-native/1.0.11-r0/git/IGC/BiFModule/Languages/OpenCL/PreRelease/opencl_cth_pre_release.h
| [3/565] cd /disk0/scratch/smonsees/yocto/workspace_1/builds2/sbcb-default/tmp/work/x86_64-linux/intel-graphics-compiler-native/1.0.11-r0/build/IGC/autogen/MDAutogen && /disk0/scratch/smonsees/yocto/workspace_1/builds2/sbcb-default/tmp/hosttools/python3 /disk0/scratch/smonsees/yocto/workspace_1/builds2/sbcb-default/tmp/work/x86_64-linux/intel-graphics-compiler-native/1.0.11-r0/git/IGC/common/autogen.py /disk0/scratch/smonsees/yocto/workspace_1/builds2/sbcb-default/tmp/work/x86_64-linux/intel-graphics-compiler-native/1.0.11-r0/git/IGC/common/MDFrameWork.h /disk0/scratch/smonsees/yocto/workspace_1/builds2/sbcb-default/tmp/work/x86_64-linux/intel-graphics-compiler-native/1.0.11-r0/build/IGC/autogen/MDNodeFunctions.gen
| [4/565] cd /disk0/scratch/smonsees/yocto/workspace_1/builds2/sbcb-default/tmp/work/x86_64-linux/intel-graphics-compiler-native/1.0.11-r0/build/IGC/GenISAIntrinsics && /disk0/scratch/smonsees/yocto/workspace_1/builds2/sbcb-default/tmp/hosttools/python3 /disk0/scratch/smonsees/yocto/workspace_1/builds2/sbcb-default/tmp/work/x86_64-linux/intel-graphics-compiler-native/1.0.11-r0/git/IGC/GenISAIntrinsics/Intrinsics.py Intrinsic_definitions.py /disk0/scratch/smonsees/yocto/workspace_1/builds2/sbcb-default/tmp/work/x86_64-linux/intel-graphics-compiler-native/1.0.11-r0/build/IGC/Release/IntrinsicGenISA.gen
| [5/565] /disk0/scratch/smonsees/yocto/workspace_1/builds2/sbcb-default/tmp/hosttools/g++ -DCL_KHR_FP64_EXT -DGHAL3D=USC -DICBE_LINUX -DIGC_CMAKE -DIGC_EXPORTS=1 -DIGC_SPIRV_ENABLED -DINSIDE_PLUGIN -DISTDLIB_UMD -DLINUX -DNDEBUG -DNOMINMAX -DSTD_CALL -DUSC_EXPORTS=1 -DUSE_MMX -DUSE_SSE -DUSE_SSE2 -DUSE_SSE3 -DUSE_SSSE3 -D_AMD64_ -D_COMPILER_DLL_ -D_CRT_SECURE_NO_WARNINGS -D_HAS_EXCEPTIONS=0 -D_IGC_ -D_SCL_SECURE_NO_WARNINGS -D__STDC_CONSTANT_MACROS -D__STDC_LIMIT_MACROS -I/disk0/scratch/smonsees/yocto/workspace_1/builds2/sbcb-default/tmp/work/x86_64-linux/intel-graphics-compiler-native/1.0.11-r0/git/IGC/WrapperLLVM/include -IIGC/autogen -I/disk0/scratch/smonsees/yocto/workspace_1/builds2/sbcb-default/tmp/work/x86_64-linux/intel-graphics-compiler-native/1.0.11-r0/git/IGC -I/disk0/scratch/smonsees/yocto/workspace_1/builds2/sbcb-default/tmp/work/x86_64-linux/intel-graphics-compiler-native/1.0.11-r0/git/IGC/common -I/disk0/scratch/smonsees/yocto/workspace_1/builds2/sbcb-default/tmp/work/x86_64-linux/intel-graphics-compiler-native/1.0.11-r0/git/IGC/.. -I/disk0/scratch/smonsees/yocto/workspace_1/builds2/sbcb-default/tmp/work/x86_64-linux/intel-graphics-compiler-native/1.0.11-r0/git/IGC/../Common -I/disk0/scratch/smonsees/yocto/workspace_1/builds2/sbcb-default/tmp/work/x86_64-linux/intel-graphics-compiler-native/1.0.11-r0/git/IGC/../3d/common -I/disk0/scratch/smonsees/yocto/workspace_1/builds2/sbcb-default/tmp/work/x86_64-linux/intel-graphics-compiler-native/1.0.11-r0/git/IGC/../inc -I/disk0/scratch/smonsees/yocto/workspace_1/builds2/sbcb-default/tmp/work/x86_64-linux/intel-graphics-compiler-native/1.0.11-r0/git/IGC/../inc/common -I/disk0/scratch/smonsees/yocto/workspace_1/builds2/sbcb-default/tmp/work/x86_64-linux/intel-graphics-compiler-native/1.0.11-r0/git/IGC/../inc/common/Compiler -I/disk0/scratch/smonsees/yocto/workspace_1/builds2/sbcb-default/tmp/work/x86_64-linux/intel-graphics-compiler-native/1.0.11-r0/git/IGC/../inc/common/Compiler/API -I/disk0/scratch/smonsees/yocto/workspace_1/builds2/sbcb-default/tmp/work/x86_64-linux/intel-graphics-compiler-native/1.0.11-r0/git/IGC/../visa/include -IIGC/Release -I/disk0/scratch/smonsees/yocto/workspace_1/builds2/sbcb-default/tmp/work/x86_64-linux/intel-graphics-compiler-native/1.0.11-r0/git/IGC/AdaptorOCL/ocl_igc_shared/executable_format -I/disk0/scratch/smonsees/yocto/workspace_1/builds2/sbcb-default/tmp/work/x86_64-linux/intel-graphics-compiler-native/1.0.11-r0/git/IGC/AdaptorOCL -I/disk0/scratch/smonsees/yocto/workspace_1/builds2/sbcb-default/tmp/work/x86_64-linux/intel-graphics-compiler-native/1.0.11-r0/git/IGC/../inc/common/Compiler/common -I/disk0/scratch/smonsees/yocto/workspace_1/builds2/sbcb-default/tmp/work/x86_64-linux/intel-graphics-compiler-native/1.0.11-r0/git/IGC/AdaptorOCL/cif/cif/.. -I/disk0/scratch/smonsees/yocto/workspace_1/builds2/sbcb-default/tmp/work/x86_64-linux/intel-graphics-compiler-native/1.0.11-r0/git/IGC/GenISAIntrinsics -isystem/disk0/scratch/smonsees/yocto/workspace_1/builds2/sbcb-default/tmp/work/x86_64-linux/intel-graphics-compiler-native/1.0.11-r0/recipe-sysroot-native/usr/include -pipe -fno-exceptions -fdata-sections -ffunction-sections -O2 -fmessage-length=0 -march=corei7 -mstackrealign -fms-extensions -Werror -Wno-unused-parameter -Wno-missing-field-initializers -Wwrite-strings -Wno-long-long -Wswitch -Wno-sign-compare -Wno-unused-result -Wno-enum-compare -Wno-type-limits -Wno-ignored-qualifiers -Wformat -Wformat-security -Wno-extra -Wno-write-strings -finline -fno-strict-aliasing -msse -msse2 -msse3 -mssse3 -msse4 -msse4.1 -msse4.2 -Wno-unknown-pragmas -fPIC -D_FORTIFY_SOURCE=2 -fstack-protector -finline-functions -funswitch-loops -Wno-maybe-uninitialized -lrt -fno-rtti -fvisibility=hidden -fvisibility-inlines-hidden -std=c++14 -DNDEBUG -g -std=gnu++1y -MD -MT IGC/GenISAIntrinsics/CMakeFiles/GenISAIntrinsics.dir/GenIntrinsics.cpp.o -MF IGC/GenISAIntrinsics/CMakeFiles/GenISAIntrinsics.dir/GenIntrinsics.cpp.o.d -o IGC/GenISAIntrinsics/CMakeFiles/GenISAIntrinsics.dir/GenIntrinsics.cpp.o -c /disk0/scratch/smonsees/yocto/workspace_1/builds2/sbcb-default/tmp/work/x86_64-linux/intel-graphics-compiler-native/1.0.11-r0/git/IGC/GenISAIntrinsics/GenIntrinsics.cpp
| FAILED: IGC/GenISAIntrinsics/CMakeFiles/GenISAIntrinsics.dir/GenIntrinsics.cpp.o
| /disk0/scratch/smonsees/yocto/workspace_1/builds2/sbcb-default/tmp/hosttools/g++ -DCL_KHR_FP64_EXT -DGHAL3D=USC -DICBE_LINUX -DIGC_CMAKE -DIGC_EXPORTS=1 -DIGC_SPIRV_ENABLED -DINSIDE_PLUGIN -DISTDLIB_UMD -DLINUX -DNDEBUG -DNOMINMAX -DSTD_CALL -DUSC_EXPORTS=1 -DUSE_MMX -DUSE_SSE -DUSE_SSE2 -DUSE_SSE3 -DUSE_SSSE3 -D_AMD64_ -D_COMPILER_DLL_ -D_CRT_SECURE_NO_WARNINGS -D_HAS_EXCEPTIONS=0 -D_IGC_ -D_SCL_SECURE_NO_WARNINGS -D__STDC_CONSTANT_MACROS -D__STDC_LIMIT_MACROS -I/disk0/scratch/smonsees/yocto/workspace_1/builds2/sbcb-default/tmp/work/x86_64-linux/intel-graphics-compiler-native/1.0.11-r0/git/IGC/WrapperLLVM/include -IIGC/autogen -I/disk0/scratch/smonsees/yocto/workspace_1/builds2/sbcb-default/tmp/work/x86_64-linux/intel-graphics-compiler-native/1.0.11-r0/git/IGC -I/disk0/scratch/smonsees/yocto/workspace_1/builds2/sbcb-default/tmp/work/x86_64-linux/intel-graphics-compiler-native/1.0.11-r0/git/IGC/common -I/disk0/scratch/smonsees/yocto/workspace_1/builds2/sbcb-default/tmp/work/x86_64-linux/intel-graphics-compiler-native/1.0.11-r0/git/IGC/.. -I/disk0/scratch/smonsees/yocto/workspace_1/builds2/sbcb-default/tmp/work/x86_64-linux/intel-graphics-compiler-native/1.0.11-r0/git/IGC/../Common -I/disk0/scratch/smonsees/yocto/workspace_1/builds2/sbcb-default/tmp/work/x86_64-linux/intel-graphics-compiler-native/1.0.11-r0/git/IGC/../3d/common -I/disk0/scratch/smonsees/yocto/workspace_1/builds2/sbcb-default/tmp/work/x86_64-linux/intel-graphics-compiler-native/1.0.11-r0/git/IGC/../inc -I/disk0/scratch/smonsees/yocto/workspace_1/builds2/sbcb-default/tmp/work/x86_64-linux/intel-graphics-compiler-native/1.0.11-r0/git/IGC/../inc/common -I/disk0/scratch/smonsees/yocto/workspace_1/builds2/sbcb-default/tmp/work/x86_64-linux/intel-graphics-compiler-native/1.0.11-r0/git/IGC/../inc/common/Compiler -I/disk0/scratch/smonsees/yocto/workspace_1/builds2/sbcb-default/tmp/work/x86_64-linux/intel-graphics-compiler-native/1.0.11-r0/git/IGC/../inc/common/Compiler/API -I/disk0/scratch/smonsees/yocto/workspace_1/builds2/sbcb-default/tmp/work/x86_64-linux/intel-graphics-compiler-native/1.0.11-r0/git/IGC/../visa/include -IIGC/Release -I/disk0/scratch/smonsees/yocto/workspace_1/builds2/sbcb-default/tmp/work/x86_64-linux/intel-graphics-compiler-native/1.0.11-r0/git/IGC/AdaptorOCL/ocl_igc_shared/executable_format -I/disk0/scratch/smonsees/yocto/workspace_1/builds2/sbcb-default/tmp/work/x86_64-linux/intel-graphics-compiler-native/1.0.11-r0/git/IGC/AdaptorOCL -I/disk0/scratch/smonsees/yocto/workspace_1/builds2/sbcb-default/tmp/work/x86_64-linux/intel-graphics-compiler-native/1.0.11-r0/git/IGC/../inc/common/Compiler/common -I/disk0/scratch/smonsees/yocto/workspace_1/builds2/sbcb-default/tmp/work/x86_64-linux/intel-graphics-compiler-native/1.0.11-r0/git/IGC/AdaptorOCL/cif/cif/.. -I/disk0/scratch/smonsees/yocto/workspace_1/builds2/sbcb-default/tmp/work/x86_64-linux/intel-graphics-compiler-native/1.0.11-r0/git/IGC/GenISAIntrinsics -isystem/disk0/scratch/smonsees/yocto/workspace_1/builds2/sbcb-default/tmp/work/x86_64-linux/intel-graphics-compiler-native/1.0.11-r0/recipe-sysroot-native/usr/include -pipe -fno-exceptions -fdata-sections -ffunction-sections -O2 -fmessage-length=0 -march=corei7 -mstackrealign -fms-extensions -Werror -Wno-unused-parameter -Wno-missing-field-initializers -Wwrite-strings -Wno-long-long -Wswitch -Wno-sign-compare -Wno-unused-result -Wno-enum-compare -Wno-type-limits -Wno-ignored-qualifiers -Wformat -Wformat-security -Wno-extra -Wno-write-strings -finline -fno-strict-aliasing -msse -msse2 -msse3 -mssse3 -msse4 -msse4.1 -msse4.2 -Wno-unknown-pragmas -fPIC -D_FORTIFY_SOURCE=2 -fstack-protector -finline-functions -funswitch-loops -Wno-maybe-uninitialized -lrt -fno-rtti -fvisibility=hidden -fvisibility-inlines-hidden -std=c++14 -DNDEBUG -g -std=gnu++1y -MD -MT IGC/GenISAIntrinsics/CMakeFiles/GenISAIntrinsics.dir/GenIntrinsics.cpp.o -MF IGC/GenISAIntrinsics/CMakeFiles/GenISAIntrinsics.dir/GenIntrinsics.cpp.o.d -o IGC/GenISAIntrinsics/CMakeFiles/GenISAIntrinsics.dir/GenIntrinsics.cpp.o -c /disk0/scratch/smonsees/yocto/workspace_1/builds2/sbcb-default/tmp/work/x86_64-linux/intel-graphics-compiler-native/1.0.11-r0/git/IGC/GenISAIntrinsics/GenIntrinsics.cpp
| g++: error: unrecognized command line option ‘-std=c++14’
| [6/565] cd /disk0/scratch/smonsees/yocto/workspace_1/builds2/sbcb-default/tmp/work/x86_64-linux/intel-graphics-compiler-native/1.0.11-r0/git/visa && /disk0/scratch/smonsees/yocto/workspace_1/builds2/sbcb-default/tmp/work/x86_64-linux/intel-graphics-compiler-native/1.0.11-r0/recipe-sysroot-native/usr/bin/bison -vt -p CISA -d -o /disk0/scratch/smonsees/yocto/workspace_1/builds2/sbcb-default/tmp/work/x86_64-linux/intel-graphics-compiler-native/1.0.11-r0/build/IGC/visa/CISA.tab.cpp CISA.y
| CISA.y:84.1-14: warning: deprecated directive, use ‘%define parse.error verbose’ [-Wdeprecated]
| 84 | %error-verbose
| | ^~~~~~~~~~~~~~
| CISA.y: warning: 1 nonterminal useless in grammar [-Wother]
| CISA.y: warning: 1 rule useless in grammar [-Wother]
| CISA.y:1478.1-16: warning: nonterminal useless in grammar: VecSrcOpndSimple [-Wother]
| 1478 | VecSrcOpndSimple : VAR TwoDimOffset
| | ^~~~~~~~~~~~~~~~
| CISA.y: warning: 140 shift/reduce conflicts [-Wconflicts-sr]
| CISA.y: warning: 20 reduce/reduce conflicts [-Wconflicts-rr]
| CISA.y: warning: fix-its can be applied. Rerun with option '--update'. [-Wother]
| [7/565] cd /disk0/scratch/smonsees/yocto/workspace_1/builds2/sbcb-default/tmp/work/x86_64-linux/intel-graphics-compiler-native/1.0.11-r0/build/IGC/BiFModule && /disk0/scratch/smonsees/yocto/workspace_1/builds2/sbcb-default/tmp/work/x86_64-linux/intel-graphics-compiler-native/1.0.11-r0/recipe-sysroot-native/usr/bin/cmake -E make_directory /disk0/scratch/smonsees/yocto/workspace_1/builds2/sbcb-default/tmp/work/x86_64-linux/intel-graphics-compiler-native/1.0.11-r0/build/IGC/Release/bif/. && /disk0/scratch/smonsees/yocto/workspace_1/builds2/sbcb-default/tmp/work/x86_64-linux/intel-graphics-compiler-native/1.0.11-r0/recipe-sysroot-native/usr/bin/clang-9 -cc1 -x cl -fblocks -fpreserve-vec3-type -opencl-builtins -triple=spir64 -w -emit-llvm-bc -o /disk0/scratch/smonsees/yocto/workspace_1/builds2/sbcb-default/tmp/work/x86_64-linux/intel-graphics-compiler-native/1.0.11-r0/build/IGC/Release/bif/./IBiF_spirv_size_t_64.bc_pointersize__cl__0.bc.tmp -include /disk0/scratch/smonsees/yocto/workspace_1/builds2/sbcb-default/tmp/work/x86_64-linux/intel-graphics-compiler-native/1.0.11-r0/build/IGC/Release/bif/./opencl_cth.h -I /disk0/scratch/smonsees/yocto/workspace_1/builds2/sbcb-default/tmp/work/x86_64-linux/intel-graphics-compiler-native/1.0.11-r0/git/IGC/BiFModule/Languages/OpenCL -I /disk0/scratch/smonsees/yocto/workspace_1/builds2/sbcb-default/tmp/work/x86_64-linux/intel-graphics-compiler-native/1.0.11-r0/git/IGC/BiFModule/Languages/OpenCL/PointerSize -I /disk0/scratch/smonsees/yocto/workspace_1/builds2/sbcb-default/tmp/work/x86_64-linux/intel-graphics-compiler-native/1.0.11-r0/git/IGC/BiFModule/Headers -I /disk0/scratch/smonsees/yocto/workspace_1/builds2/sbcb-default/tmp/work/x86_64-linux/intel-graphics-compiler-native/1.0.11-r0/git/IGC/BiFModule/../AdaptorOCL/ocl_igc_shared/device_enqueue -D__EXECUTION_MODEL_DEBUG=1 -D__OPENCL_C_VERSION__=200 -D__IGC_BUILD__ -Dcl_khr_f16 -Dcl_khrfp64 -Dcl_khr_gl_msaa_sharing -Dcl_khr_mipmap_image -Dcl_khr_depth_images -Dcl_intel_subgroups_short -Dcl_intel_subgroups_char -Dcl_intel_subgroups_long -Dcl_intel_64bit_global_atomics_placeholder -D__VME_TYPES_DEFINED__ -finclude-default-header -cl-std=CL2.0 /disk0/scratch/smonsees/yocto/workspace_1/builds2/sbcb-default/tmp/work/x86_64-linux/intel-graphics-compiler-native/1.0.11-r0/git/IGC/BiFModule/Implementation/pointersize.cl
| [8/565] cd /disk0/scratch/smonsees/yocto/workspace_1/builds2/sbcb-default/tmp/work/x86_64-linux/intel-graphics-compiler-native/1.0.11-r0/build/IGC/BiFModule && /disk0/scratch/smonsees/yocto/workspace_1/builds2/sbcb-default/tmp/work/x86_64-linux/intel-graphics-compiler-native/1.0.11-r0/recipe-sysroot-native/usr/bin/cmake -E make_directory /disk0/scratch/smonsees/yocto/workspace_1/builds2/sbcb-default/tmp/work/x86_64-linux/intel-graphics-compiler-native/1.0.11-r0/build/IGC/Release/bif/. && /disk0/scratch/smonsees/yocto/workspace_1/builds2/sbcb-default/tmp/work/x86_64-linux/intel-graphics-compiler-native/1.0.11-r0/recipe-sysroot-native/usr/bin/clang-9 -cc1 -x cl -fblocks -fpreserve-vec3-type -opencl-builtins -triple=spir64 -w -emit-llvm-bc -o /disk0/scratch/smonsees/yocto/workspace_1/builds2/sbcb-default/tmp/work/x86_64-linux/intel-graphics-compiler-native/1.0.11-r0/build/IGC/Release/bif/./IBiF_Impl_int_spirv.bc_IBiF_Impl__cl__0.bc.tmp -include /disk0/scratch/smonsees/yocto/workspace_1/builds2/sbcb-default/tmp/work/x86_64-linux/intel-graphics-compiler-native/1.0.11-r0/build/IGC/Release/bif/./opencl_cth.h -I /disk0/scratch/smonsees/yocto/workspace_1/builds2/sbcb-default/tmp/work/x86_64-linux/intel-graphics-compiler-native/1.0.11-r0/git/IGC/BiFModule/Implementation -I /disk0/scratch/smonsees/yocto/workspace_1/builds2/sbcb-default/tmp/work/x86_64-linux/intel-graphics-compiler-native/1.0.11-r0/git/IGC/BiFModule/Headers -I /disk0/scratch/smonsees/yocto/workspace_1/builds2/sbcb-default/tmp/work/x86_64-linux/intel-graphics-compiler-native/1.0.11-r0/git/IGC/BiFModule/../AdaptorOCL/ocl_igc_interface/device_enqueue -D__EXECUTION_MODEL_DEBUG=1 -D__OPENCL_C_VERSION__=200 -D__IGC_BUILD__ -Dcl_khr_f16 -Dcl_khrfp64 -Dcl_khr_gl_msaa_sharing -Dcl_khr_mipmap_image -Dcl_khr_depth_images -Dcl_intel_subgroups_short -Dcl_intel_subgroups_char -Dcl_intel_subgroups_long -Dcl_intel_64bit_global_atomics_placeholder -D__VME_TYPES_DEFINED__ -finclude-default-header -cl-std=CL2.0 /disk0/scratch/smonsees/yocto/workspace_1/builds2/sbcb-default/tmp/work/x86_64-linux/intel-graphics-compiler-native/1.0.11-r0/git/IGC/BiFModule/Implementation/IBiF_Impl.cl
| ninja: build stopped: subcommand failed.
| WARNING: /disk0/scratch/smonsees/yocto/workspace_1/builds2/sbcb-default/tmp/work/x86_64-linux/intel-graphics-compiler-native/1.0.11-r0/temp/run.do_compile.26870:1 exit 1 from 'VERBOSE=1 cmake --build /disk0/scratch/smonsees/yocto/workspace_1/builds2/sbcb-default/tmp/work/x86_64-linux/intel-graphics-compiler-native/1.0.11-r0/build --target all -- -j 4'
|

-----Original Message-----
From: yocto@... <yocto@...> On Behalf Of Monsees, Steven C (US) via lists.yoctoproject.org
Sent: Tuesday, October 12, 2021 7:22 AM
To: Mittal, Anuj <anuj.mittal@...>; yocto@...
Subject: Re: [yocto] #zeus meta-intel

External Email Alert

This email has been sent from an account outside of the BAE Systems network.

Please treat the email with caution, especially if you are requested to click on a link, decrypt/open an attachment, or enable macros. For further information on how to spot phishing, access “Cybersecurity OneSpace Page” and report phishing by clicking the button “Report Phishing” on the Outlook toolbar.



Anuj:

Are there any other possible dependencies for the “meta-intel/dynamic-layers/clang-layer/recipes-
opencl” ?

Is this dependent on systemd ?

It appears to builds clean, but fails/faults while booting kernel...

Thanks again,
Steve

-----Original Message-----
From: Mittal, Anuj <anuj.mittal@...>
Sent: Friday, October 8, 2021 11:05 PM
To: Monsees, Steven C (US) <steven.monsees@...>; yocto@...
Subject: Re: [yocto] #zeus meta-intel

External Email Alert

This email has been sent from an account outside of the BAE Systems network.

Please treat the email with caution, especially if you are requested to click on a link, decrypt/open an attachment, or enable macros. For further information on how to spot phishing, access “Cybersecurity OneSpace Page” and report phishing by clicking the button “Report Phishing” on the Outlook toolbar.


On Fri, 2021-10-08 at 16:10 +0000, Monsees, Steven C (US) via lists.yoctoproject.org wrote:

Sorry for my ignorance, but I am missing your point, what exactly does
the recipe provide when built, intel-opencl-icd ?, will it pull in igc
?
It will pull in igc. There's a separate recipe for igc in meta-intel.
compute-runtime will provide intel-opencl-icd but the package name is different.

You can try building the recipe.

Thanks,

Anuj


-----Original Message-----
From: Mittal, Anuj <anuj.mittal@...>
Sent: Friday, October 8, 2021 12:01 PM
To: Monsees, Steven C (US) <steven.monsees@...>;
yocto@...
Subject: Re: [yocto] #zeus meta-intel

External Email Alert

This email has been sent from an account outside of the BAE Systems
network.

Please treat the email with caution, especially if you are requested
to click on a link, decrypt/open an attachment, or enable macros.
For further information on how to spot phishing, access “Cybersecurity
OneSpace Page” and report phishing by clicking the button “Report
Phishing” on the Outlook toolbar.


Sorry, I didn't understand the question. If you want to know which
version of OpenCL is supported, please see the README for version that
you're building. Also see:

https://github.com/intel/compute-runtime/blob/master/opencl/doc/FAQ.md

Thanks,

Anuj

On Fri, 2021-10-08 at 15:30 +0000, Monsees, Steven C (US) wrote:

Thank you, just for clarification ...

"Building the Neo driver", does that mean no OpenCL library support
?

-----Original Message-----
From: Mittal, Anuj <anuj.mittal@...>
Sent: Friday, October 8, 2021 11:07 AM
To: Monsees, Steven C (US) <steven.monsees@...>;
yocto@...
Subject: Re: [yocto] #zeus meta-intel

External Email Alert

This email has been sent from an account outside of the BAE Systems
network.

Please treat the email with caution, especially if you are requested
to click on a link, decrypt/open an attachment, or enable macros.
For
further information on how to spot phishing, access “Cybersecurity
OneSpace Page” and report phishing by clicking the button “Report
Phishing” on the Outlook toolbar.


On Thu, 2021-10-07 at 16:20 +0000, Monsees, Steven C (US) via
lists.yoctoproject.org wrote:
 
 
I am looking at “meta-intel/dynamic-layers/clang-layer/recipes-
opencl/compute-runtime”
I have been “told” that this compute-runtime recipe should
basically build opencl (Neo) with all the required dependencies… I
did not think Yocto had support for OpenCL, and was looking to
build Neo under the SDK.
 
(1)   Is this true, does meta-intell under zeus now support
building OpenCL and the OpenCL Graphics compiler under Yocto ?
compute-runtime recipe would allow you to build NEO driver. zeus is
no longer maintained so the version there is old and not tested now
but it should still build.

(2)   Of so, what would be the proper way to pull this into my
yocto build ?
Including meta-intel and meta-clang in bblayers should be enough.

Thanks,

Anuj



Using meta-qt5-extra layer build KDE support on riscv target #yocto

sateesh m
 

Hi Guys,

I am facing bellow error while building KDE support using meta-qt5-extra layer.can any body know please suggest me how can i fix this problem.

I have added already qttools -> this will provide Qt5LinguistTools but getting below error.

Error displayed:
 
CMake Error at /usr/share/ECM/modules/ECMPoQmTools.cmake:144 (find_package):   Could not find a package configuration file provided by "Qt5LinguistTools"
  with any of the following names:

    Qt5LinguistToolsConfig.cmake
    qt5linguisttools-config.cmake

  Add the installation prefix of "Qt5LinguistTools" to CMAKE_PREFIX_PATH or
  set "Qt5LinguistTools_DIR" to a directory containing one of the above
  files.  If "Qt5LinguistTools" provides a separate development package or
  SDK, be sure it has been installed.
Call Stack (most recent call first):
  /usr/share/ECM/modules/ECMPoQmTools.cmake:234 (ecm_process_po_files_as_qm)
  CMakeLists.txt:317 (ecm_install_po_files_as_qm)


-- Configuring incomplete, errors occurred!
See also "/usr/src/kde/phonon-4.10.3/build/CMakeFiles/CMakeOutput.log".
 
--
Regards,
Sateesh


Re: #zeus meta-intel #zeus

Monsees, Steven C (US)
 

Anuj:

Are there any other possible dependencies for the “meta-intel/dynamic-layers/clang-layer/recipes-
opencl” ?

Is this dependent on systemd ?

It appears to builds clean, but fails/faults while booting kernel...

Thanks again,
Steve

-----Original Message-----
From: Mittal, Anuj <anuj.mittal@...>
Sent: Friday, October 8, 2021 11:05 PM
To: Monsees, Steven C (US) <steven.monsees@...>; yocto@...
Subject: Re: [yocto] #zeus meta-intel

External Email Alert

This email has been sent from an account outside of the BAE Systems network.

Please treat the email with caution, especially if you are requested to click on a link, decrypt/open an attachment, or enable macros. For further information on how to spot phishing, access “Cybersecurity OneSpace Page” and report phishing by clicking the button “Report Phishing” on the Outlook toolbar.


On Fri, 2021-10-08 at 16:10 +0000, Monsees, Steven C (US) via lists.yoctoproject.org wrote:

Sorry for my ignorance, but I am missing your point, what exactly does
the recipe provide when built, intel-opencl-icd ?, will it pull in igc
?
It will pull in igc. There's a separate recipe for igc in meta-intel.
compute-runtime will provide intel-opencl-icd but the package name is different.

You can try building the recipe.

Thanks,

Anuj


-----Original Message-----
From: Mittal, Anuj <anuj.mittal@...>
Sent: Friday, October 8, 2021 12:01 PM
To: Monsees, Steven C (US) <steven.monsees@...>;
yocto@...
Subject: Re: [yocto] #zeus meta-intel

External Email Alert

This email has been sent from an account outside of the BAE Systems
network.

Please treat the email with caution, especially if you are requested
to click on a link, decrypt/open an attachment, or enable macros.
For further information on how to spot phishing, access “Cybersecurity
OneSpace Page” and report phishing by clicking the button “Report
Phishing” on the Outlook toolbar.


Sorry, I didn't understand the question. If you want to know which
version of OpenCL is supported, please see the README for version that
you're building. Also see:

https://github.com/intel/compute-runtime/blob/master/opencl/doc/FAQ.md

Thanks,

Anuj

On Fri, 2021-10-08 at 15:30 +0000, Monsees, Steven C (US) wrote:

Thank you, just for clarification ...

"Building the Neo driver", does that mean no OpenCL library support
?

-----Original Message-----
From: Mittal, Anuj <anuj.mittal@...>
Sent: Friday, October 8, 2021 11:07 AM
To: Monsees, Steven C (US) <steven.monsees@...>;
yocto@...
Subject: Re: [yocto] #zeus meta-intel

External Email Alert

This email has been sent from an account outside of the BAE Systems
network.

Please treat the email with caution, especially if you are requested
to click on a link, decrypt/open an attachment, or enable macros.
For
further information on how to spot phishing, access “Cybersecurity
OneSpace Page” and report phishing by clicking the button “Report
Phishing” on the Outlook toolbar.


On Thu, 2021-10-07 at 16:20 +0000, Monsees, Steven C (US) via
lists.yoctoproject.org wrote:
 
 
I am looking at “meta-intel/dynamic-layers/clang-layer/recipes-
opencl/compute-runtime”
I have been “told” that this compute-runtime recipe should
basically build opencl (Neo) with all the required dependencies… I
did not think Yocto had support for OpenCL, and was looking to
build Neo under the SDK.
 
(1)   Is this true, does meta-intell under zeus now support
building OpenCL and the OpenCL Graphics compiler under Yocto ?
compute-runtime recipe would allow you to build NEO driver. zeus is
no longer maintained so the version there is old and not tested now
but it should still build.

(2)   Of so, what would be the proper way to pull this into my
yocto build ?
Including meta-intel and meta-clang in bblayers should be enough.

Thanks,

Anuj



[meta-selinux][PATCH 3/4] selinux-python: add RDEPENDES on audit-python

Yi Zhao
 

Add RDEPENDS on audit-python for selinux-python-semanage.

Fixes:
$ semanage fcontext -a -t user_home_t "/web(/.*)?"
Traceback (most recent call last):
File "/usr/sbin/semanage", line 975, in <module>
do_parser()
File "/usr/sbin/semanage", line 947, in do_parser
args.func(args)
File "/usr/sbin/semanage", line 329, in handleFcontext
OBJECT.add(args.file_spec, args.type, args.ftype, args.range, args.seuser)
File "/usr/lib/python3.9/site-packages/seobject.py", line 2485, in add
self.__add(target, type, ftype, serange, seuser)
File "/usr/lib/python3.9/site-packages/seobject.py", line 2481, in __add
self.mylog.log_change("resrc=fcontext op=add %s ftype=%s tcontext=%s:%s:%s:%s"
% (audit.audit_encode_nv_string("tglob", target, 0), ftype_to_audit[ftype],)
NameError: name 'audit' is not defined

Signed-off-by: Yi Zhao <yi.zhao@...>
---
recipes-security/selinux/selinux-python_3.2.bb | 1 +
1 file changed, 1 insertion(+)

diff --git a/recipes-security/selinux/selinux-python_3.2.bb b/recipes-security/selinux/selinux-python_3.2.bb
index a954676..d130900 100644
--- a/recipes-security/selinux/selinux-python_3.2.bb
+++ b/recipes-security/selinux/selinux-python_3.2.bb
@@ -50,6 +50,7 @@ RDEPENDS:${BPN}-semanage += "\
python3-xml \
python3-misc \
libselinux-python \
+ audit-python \
${BPN} \
"
RDEPENDS:${BPN}-sepolicy += "\
--
2.25.1


[meta-selinux][PATCH 1/4] libselinux: inherit pkgconfig

Yi Zhao
 

Inherit pkgconfig to fix the build error which is introduced by
oe-commit:
commit 8e26252b45b7660c7c67c702411bdec187a76ffc
Author: Richard Purdie <richard.purdie@...>
Date: Sun Sep 19 16:17:31 2021 +0100

layer.conf: Extend recipes not to install without explict dependencies

Fixes:
make: pkg-config: Command not found
/usr/src/debug/libselinux/3.2-r0/git/libselinux/src/regex.c:399: undefined reference to `pcre_fullinfo'
/usr/src/debug/libselinux/3.3-r0/git/libselinux/src/regex.c:444: undefined reference to `pcre_free'
/usr/src/debug/libselinux/3.3-r0/git/libselinux/src/regex.c:456: undefined reference to `pcre_exec'

Signed-off-by: Yi Zhao <yi.zhao@...>
---
recipes-security/selinux/libselinux_3.2.bb | 2 +-
1 file changed, 1 insertion(+), 1 deletion(-)

diff --git a/recipes-security/selinux/libselinux_3.2.bb b/recipes-security/selinux/libselinux_3.2.bb
index 55efbae..1144840 100644
--- a/recipes-security/selinux/libselinux_3.2.bb
+++ b/recipes-security/selinux/libselinux_3.2.bb
@@ -8,7 +8,7 @@ LIC_FILES_CHKSUM = "file://${S}/LICENSE;md5=84b4d2c6ef954a2d4081e775a270d0d0"

require selinux_common.inc

-inherit lib_package python3native
+inherit lib_package python3native pkgconfig

DEPENDS += "libsepol libpcre"
DEPENDS:append:libc-musl = " fts"
--
2.25.1


[meta-selinux][PATCH 4/4] selinux: move selinux scripts to selinux-scripts

Yi Zhao
 

There are too many recipes in recipes-security/selinux. Keep the selinux
userspace recipes and move selinux scripts to selinux-scripts directory
to make the directory hierarchy clearer.

Signed-off-by: Yi Zhao <yi.zhao@...>
---
.../selinux-autorelabel/selinux-autorelabel.service | 0
.../selinux-autorelabel/selinux-autorelabel.sh | 0
.../{selinux => selinux-scripts}/selinux-autorelabel_0.1.bb | 0
.../selinux-init/selinux-init.service | 0
.../{selinux => selinux-scripts}/selinux-init/selinux-init.sh | 0
.../selinux-init/selinux-init.sh.sysvinit | 0
recipes-security/{selinux => selinux-scripts}/selinux-init_0.1.bb | 0
recipes-security/{selinux => selinux-scripts}/selinux-initsh.inc | 0
.../selinux-labeldev/selinux-labeldev.service | 0
.../selinux-labeldev/selinux-labeldev.sh | 0
.../{selinux => selinux-scripts}/selinux-labeldev_0.1.bb | 0
11 files changed, 0 insertions(+), 0 deletions(-)
rename recipes-security/{selinux => selinux-scripts}/selinux-autorelabel/selinux-autorelabel.service (100%)
rename recipes-security/{selinux => selinux-scripts}/selinux-autorelabel/selinux-autorelabel.sh (100%)
rename recipes-security/{selinux => selinux-scripts}/selinux-autorelabel_0.1.bb (100%)
rename recipes-security/{selinux => selinux-scripts}/selinux-init/selinux-init.service (100%)
rename recipes-security/{selinux => selinux-scripts}/selinux-init/selinux-init.sh (100%)
rename recipes-security/{selinux => selinux-scripts}/selinux-init/selinux-init.sh.sysvinit (100%)
rename recipes-security/{selinux => selinux-scripts}/selinux-init_0.1.bb (100%)
rename recipes-security/{selinux => selinux-scripts}/selinux-initsh.inc (100%)
rename recipes-security/{selinux => selinux-scripts}/selinux-labeldev/selinux-labeldev.service (100%)
rename recipes-security/{selinux => selinux-scripts}/selinux-labeldev/selinux-labeldev.sh (100%)
rename recipes-security/{selinux => selinux-scripts}/selinux-labeldev_0.1.bb (100%)

diff --git a/recipes-security/selinux/selinux-autorelabel/selinux-autorelabel.service b/recipes-security/selinux-scripts/selinux-autorelabel/selinux-autorelabel.service
similarity index 100%
rename from recipes-security/selinux/selinux-autorelabel/selinux-autorelabel.service
rename to recipes-security/selinux-scripts/selinux-autorelabel/selinux-autorelabel.service
diff --git a/recipes-security/selinux/selinux-autorelabel/selinux-autorelabel.sh b/recipes-security/selinux-scripts/selinux-autorelabel/selinux-autorelabel.sh
similarity index 100%
rename from recipes-security/selinux/selinux-autorelabel/selinux-autorelabel.sh
rename to recipes-security/selinux-scripts/selinux-autorelabel/selinux-autorelabel.sh
diff --git a/recipes-security/selinux/selinux-autorelabel_0.1.bb b/recipes-security/selinux-scripts/selinux-autorelabel_0.1.bb
similarity index 100%
rename from recipes-security/selinux/selinux-autorelabel_0.1.bb
rename to recipes-security/selinux-scripts/selinux-autorelabel_0.1.bb
diff --git a/recipes-security/selinux/selinux-init/selinux-init.service b/recipes-security/selinux-scripts/selinux-init/selinux-init.service
similarity index 100%
rename from recipes-security/selinux/selinux-init/selinux-init.service
rename to recipes-security/selinux-scripts/selinux-init/selinux-init.service
diff --git a/recipes-security/selinux/selinux-init/selinux-init.sh b/recipes-security/selinux-scripts/selinux-init/selinux-init.sh
similarity index 100%
rename from recipes-security/selinux/selinux-init/selinux-init.sh
rename to recipes-security/selinux-scripts/selinux-init/selinux-init.sh
diff --git a/recipes-security/selinux/selinux-init/selinux-init.sh.sysvinit b/recipes-security/selinux-scripts/selinux-init/selinux-init.sh.sysvinit
similarity index 100%
rename from recipes-security/selinux/selinux-init/selinux-init.sh.sysvinit
rename to recipes-security/selinux-scripts/selinux-init/selinux-init.sh.sysvinit
diff --git a/recipes-security/selinux/selinux-init_0.1.bb b/recipes-security/selinux-scripts/selinux-init_0.1.bb
similarity index 100%
rename from recipes-security/selinux/selinux-init_0.1.bb
rename to recipes-security/selinux-scripts/selinux-init_0.1.bb
diff --git a/recipes-security/selinux/selinux-initsh.inc b/recipes-security/selinux-scripts/selinux-initsh.inc
similarity index 100%
rename from recipes-security/selinux/selinux-initsh.inc
rename to recipes-security/selinux-scripts/selinux-initsh.inc
diff --git a/recipes-security/selinux/selinux-labeldev/selinux-labeldev.service b/recipes-security/selinux-scripts/selinux-labeldev/selinux-labeldev.service
similarity index 100%
rename from recipes-security/selinux/selinux-labeldev/selinux-labeldev.service
rename to recipes-security/selinux-scripts/selinux-labeldev/selinux-labeldev.service
diff --git a/recipes-security/selinux/selinux-labeldev/selinux-labeldev.sh b/recipes-security/selinux-scripts/selinux-labeldev/selinux-labeldev.sh
similarity index 100%
rename from recipes-security/selinux/selinux-labeldev/selinux-labeldev.sh
rename to recipes-security/selinux-scripts/selinux-labeldev/selinux-labeldev.sh
diff --git a/recipes-security/selinux/selinux-labeldev_0.1.bb b/recipes-security/selinux-scripts/selinux-labeldev_0.1.bb
similarity index 100%
rename from recipes-security/selinux/selinux-labeldev_0.1.bb
rename to recipes-security/selinux-scripts/selinux-labeldev_0.1.bb
--
2.25.1


[meta-selinux][PATCH 2/4] libselinux-python: inherit pkgconfig

Yi Zhao
 

Inherit pkgconfig to fix the build error which is introduced by
oe-commit:
commit 8e26252b45b7660c7c67c702411bdec187a76ffc
Author: Richard Purdie <richard.purdie@...>
Date: Sun Sep 19 16:17:31 2021 +0100

layer.conf: Extend recipes not to install without explict dependencies

Fixes:
make: pkg-config: Command not found
/usr/src/debug/libselinux/3.2-r0/git/libselinux/src/regex.c:399: undefined reference to `pcre_fullinfo'
/usr/src/debug/libselinux/3.3-r0/git/libselinux/src/regex.c:444: undefined reference to `pcre_free'
/usr/src/debug/libselinux/3.3-r0/git/libselinux/src/regex.c:456: undefined reference to `pcre_exec'

Signed-off-by: Yi Zhao <yi.zhao@...>
---
recipes-security/selinux/libselinux-python_3.2.bb | 2 +-
1 file changed, 1 insertion(+), 1 deletion(-)

diff --git a/recipes-security/selinux/libselinux-python_3.2.bb b/recipes-security/selinux/libselinux-python_3.2.bb
index f589ebd..136f538 100644
--- a/recipes-security/selinux/libselinux-python_3.2.bb
+++ b/recipes-security/selinux/libselinux-python_3.2.bb
@@ -8,7 +8,7 @@ LIC_FILES_CHKSUM = "file://${S}/LICENSE;md5=84b4d2c6ef954a2d4081e775a270d0d0"

require selinux_common.inc

-inherit python3native python3targetconfig
+inherit python3native python3targetconfig pkgconfig

FILESEXTRAPATHS:prepend := "${THISDIR}/libselinux:"
SRC_URI += "\
--
2.25.1


extra-cmake-modules-native-5.81.0 Package porting on riscv target using meta-qt5-extra layer #yocto

sateesh m
 

Hi Guys,

              I am facing compile-time issue (extra-cmake-modules-native-5.81.0 ). Using bitbake extra-cmake-modules it's compiled fine. It is dependent on other packages. Using bitbake extra-cmake-modules is compiled success. other dependent package expecting extra-cmake-modules-native.

build/tmp-glibc/work/x86_64-linux/extra-cmake-modules-native/5.81.0-r0/temp/run.do_compile.21147' failed with exit code 1:
build/tmp-glibc/work/x86_64-linux/extra-cmake-modules-native/5.81.0-r0/build/docs/html > build-html.log
FAILED: docs/doc_format_html 
Could not import extension ecm (exception: cannot import name 'htmlescape')

How can I fix this issue or build time it is going to docs so how I can disable it.  or any patch available gives some suggestions to fix this issue.


Thanks & Regards,
Sateesh





Regards,
Sateesh


#dunfell #sdk #yocto #dunfell #sdk #yocto

andymishra97@...
 

I am unable to build an extensible SDK for my RISC-V machine.
Required Details:
Also, I am able to build the normal SDK successfully.
I ran this  for my custom machine "cdac-ooo".

MACHINE=cdac-ooo bitbake core-image-minimal -c populate_sdk_ext

ERROR: Task (/home/qc/anaadi/riscv-cdac-v1/build_cdac-ooo-core-image-minimal/tmp-glibc/work/cdac_ooo-oe-linux/core-image-minimal/1.0-r0/sdk-ext/image/tmp-renamed-sdk/layers/openembedded-core/meta/recipes-graphics/xorg-util/util-macros_1.19.2.bb:do_fetch) failed with exit code 'setscene whitelist'
I am attaching the log file with reference to the error.

I also tried using,
SDK_EXT_TYPE = "minimal"
SDK_INCLUDE_TOOLCHAIN = "1"
but that gave me an empty sysroots directory without the tool-chain.

Please Let me know what am I missing or how can I rectify this error.


Re: building the kernel's usbipd daemon

chuck kamas
 

Thanks for the quick reply. I looked at the perf recipe, and its quite involved. Is there a simpler recipie to use as a template? Perhaps one of these?

meta-openembedded/meta-oe/recipes-kernel/bpftool/bpftool.bb

meta-openembedded/meta-oe/recipes-kernel/spidev-test/spidev-test.bb

meta-openembedded/meta-oe/recipes-kernel/cpupower/cpupower.bb


all three of these appear to be basically the same very simple bb file.


Chuck


On 10/11/21 5:46 PM, Bruce Ashfield wrote:
On Mon, Oct 11, 2021 at 6:16 PM chuck kamas via lists.yoctoproject.org
<chuckkamas=yahoo.com@...> wrote:
Hi all,


I've googled most of the day, but to no avail. How does one compile and
add to the image the daemon usbipd? Is there a bitbake file already for
this? The code is part of the kernel found in the kernel tree:

KERNEL_SRC_PATH/tools/usb/usbip/src

and is invoked from the KERNEL_SRC_PATH/tools directory by calling

make usb


from:
https://wiki.st.com/stm32mpu/wiki/How_to_build_Linux_kernel_user_space_tools

PC $> cd <Linux_kernel_source_path>/tools
PC $> make <tool>


I would think that there is a preexisting recipe.
There isn't one that I've ever heard of, and the layerindex
(http://layers.openembedded.org/) confirms that nothing registered
with it provides that recipe.

So if you need it, you'd have to create a recipe .. and submit it to
somewhere like meta-openembedded if appropriate.

Have a look at the perf recipe for one of the ways we build tools out
of the kernel source. Something similar will work in this case.

Bruce

thanks,

Chuck










Re: Error while installing Python modules using pip3 in yocto zeus #zeus

Poornesh G
 

Greetings !

I am working on Rockpis Board with Yocto Zeus for development . When I am trying to install  Python modules "backports.zoneinfo" using pip3 I am facing the below error . Kindly requesting any suggestions to resolve.

Error Log:
---------------------------------------------------------------------------------------------------------------------------------------------------------------------------------------------
Building wheels for collected packages: backports.zoneinfo
  Building wheel for backports.zoneinfo (PEP 517) ... error
  ERROR: Command errored out with exit status 1:
   command: /usr/bin/python3 /usr/lib/python3.7/site-packages/pip/_vendor/pep517/in_process/_in_process.py build_wheel /tmp/tmpj158xpon
       cwd: /tmp/pip-install-e1zrr5gk/backports-zoneinfo_fe1585f6e0ef47be9df309ad556bbecf
  Complete output (39 lines):
  running bdist_wheel
  running build
  running build_py
  creating build
  creating build/lib.linux-aarch64-3.7
  creating build/lib.linux-aarch64-3.7/backports
  copying src/backports/__init__.py -> build/lib.linux-aarch64-3.7/backports
  creating build/lib.linux-aarch64-3.7/backports/zoneinfo
  copying src/backports/zoneinfo/_zoneinfo.py -> build/lib.linux-aarch64-3.7/backports/zoneinfo
  copying src/backports/zoneinfo/_version.py -> build/lib.linux-aarch64-3.7/backports/zoneinfo
  copying src/backports/zoneinfo/_tzpath.py -> build/lib.linux-aarch64-3.7/backports/zoneinfo
  copying src/backports/zoneinfo/_common.py -> build/lib.linux-aarch64-3.7/backports/zoneinfo
  copying src/backports/zoneinfo/__init__.py -> build/lib.linux-aarch64-3.7/backports/zoneinfo
  running egg_info
  writing src/backports.zoneinfo.egg-info/PKG-INFO
  writing dependency_links to src/backports.zoneinfo.egg-info/dependency_links.txt
  writing requirements to src/backports.zoneinfo.egg-info/requires.txt
  writing top-level names to src/backports.zoneinfo.egg-info/top_level.txt
  reading manifest file 'src/backports.zoneinfo.egg-info/SOURCES.txt'
  reading manifest template 'MANIFEST.in'
  warning: no files found matching '*.png' under directory 'docs'
  warning: no files found matching '*.svg' under directory 'docs'
  no previously-included directories found matching 'docs/_build'
  no previously-included directories found matching 'docs/_output'
  adding license file 'LICENSE'
  adding license file 'licenses/LICENSE_APACHE'
  writing manifest file 'src/backports.zoneinfo.egg-info/SOURCES.txt'
  copying src/backports/zoneinfo/__init__.pyi -> build/lib.linux-aarch64-3.7/backports/zoneinfo
  copying src/backports/zoneinfo/py.typed -> build/lib.linux-aarch64-3.7/backports/zoneinfo
  running build_ext
  building 'backports.zoneinfo._czoneinfo' extension
  creating build/temp.linux-aarch64-3.7
  creating build/temp.linux-aarch64-3.7/lib
  aarch64-poky-linux-gcc -mcpu=cortex-a35+crc+crypto -fstack-protector-strong -D_FORTIFY_SOURCE=2 -Wformat -Wformat-security -Werror=format-security -Wno-unused-result -Wsign-compare -DNDEBUG -g -O3 -Wa9
  lib/zoneinfo_module.c:1:10: fatal error: Python.h: No such file or directory
      1 | #include "Python.h"
        |          ^~~~~~~~~~
  compilation terminated.
  error: command 'aarch64-poky-linux-gcc' failed with exit status 1
  ----------------------------------------
  ERROR: Failed building wheel for backports.zoneinfo
Failed to build backports.zoneinfo
ERROR: Could not build wheels for backports.zoneinfo which use PEP 517 and cannot be installed directly

----------------------------------------------------------------------------------------------------------------------------------------------------------------------------------

Thanks in Advance


Re: [OE-core] How to trigger Yocto Linux /etc/profile or shell scripts in /etc/profile.d without shell logging in?

Federico Pellegrin
 


Hi Jupiter,
To centralize, agreed that you are using systemd, one way I could see is setting the variables in systemd-system.conf using the DefaultEnvironment directive, see: https://freedesktop.org/software/systemd/man/systemd-system.conf.html

This states:

----
DefaultEnvironment=

Configures environment variables passed to all executed processes. Takes a space-separated list of variable assignments. See environ(7) for details about environment variables.

Simple "%"-specifier expansion is supported, see below for a list of supported specifiers.

Example:

DefaultEnvironment="VAR1=word1 word2" VAR2=word3 "VAR3=word 5 6"

Sets three variables "VAR1", "VAR2", "VAR3".

----

This should have you variables management in each. Otherwise as you mention one can put in each script with either Environment to have them explicitly enumerated or with EnvironmentFile to read from a file, which may also fit your centralization hopes (but still require one line per startup script at least) and could be further sourced by non-systemd components as well if needed. (https://www.freedesktop.org/software/systemd/man/systemd.exec.html under Environment section)

HTH,
Federico


Il giorno lun 11 ott 2021 alle ore 11:05 Jupiter <jupiter.hce@...> ha scritto:
Hi Federico,

Thanks for your response.

> /etc/profile and similar are interactive shell (/bash) concepts, not really
> system startup ones. So indeed: just on a login (be it local, ssh and so
> on) they are executed.

Understood, here is what I try to figure out. I use several systemd
services to start my tasks, each task is not just a system process, I
found it also has a system environment similar in user login from
/etcprofile, /home/user/.profile, my question is where is a system
environment file that each systemd service runs from?

I also thought that /etc/profile.d files should be automatically
invoked for each user login, but a systemd service does not run
/etc/profile.d files.

> If you want to execute something else without the need for logging it, you
> should look elsewhere, depending on your system manager: if systemd you
> should create a service and enable it, if sysvinit a init.d script.

Understood, that was what I did originally, I have to run the setup
system environment in each service ExecStart script, that is why I am
looking for a global environment setup file to avoid duplication of
putting my environment scripts in each ExecStart execution file.

Thank you.

Kind regards,

- jupiter

> HTH,
> Federico
>
>
> Il giorno lun 11 ott 2021 alle ore 06:30 JH <jupiter.hce@...> ha
> scritto:
>
>> Hi,
>>
>> The Yocto uses /etc/profile for root login, but there is no root
>> physical login in an embedded device so the /etc/profile is never
>> called, I added a shell script to /etc/profile.d, it was not called
>> either. Both /etc/profile and scripts in /etc/profile.d can only be
>> invoked when I physically log into the debug console, that is
>> impractical. Appreciate your advice, how do you resolve that kind of
>> problem?
>>
>> Thank you.
>>
>> Kind regards,
>>
>> - jupiter
>>
>>
>>
>>
>


--
"A man can fail many times, but he isn't a failure until he begins to
blame somebody else."
-- John Burroughs


Re: building the kernel's usbipd daemon

Bruce Ashfield
 

On Mon, Oct 11, 2021 at 6:16 PM chuck kamas via lists.yoctoproject.org
<chuckkamas=yahoo.com@...> wrote:

Hi all,


I've googled most of the day, but to no avail. How does one compile and
add to the image the daemon usbipd? Is there a bitbake file already for
this? The code is part of the kernel found in the kernel tree:

KERNEL_SRC_PATH/tools/usb/usbip/src

and is invoked from the KERNEL_SRC_PATH/tools directory by calling

make usb


from:
https://wiki.st.com/stm32mpu/wiki/How_to_build_Linux_kernel_user_space_tools

PC $> cd <Linux_kernel_source_path>/tools
PC $> make <tool>


I would think that there is a preexisting recipe.
There isn't one that I've ever heard of, and the layerindex
(http://layers.openembedded.org/) confirms that nothing registered
with it provides that recipe.

So if you need it, you'd have to create a recipe .. and submit it to
somewhere like meta-openembedded if appropriate.

Have a look at the perf recipe for one of the ways we build tools out
of the kernel source. Something similar will work in this case.

Bruce


thanks,

Chuck





--
- Thou shalt not follow the NULL pointer, for chaos and madness await
thee at its end
- "Use the force Harry" - Gandalf, Star Trek II


Enhancements/Bugs closed WW40!

Stephen Jolley
 

All,

The below were the owners of enhancements or bugs closed during the last week!

Who

Count

richard.purdie@...

2

mhalstead@...

1

ross@...

1

Grand Total

4

Thanks,

 

Stephen K. Jolley

Yocto Project Program Manager

(    Cell:                (208) 244-4460

* Email:              sjolley.yp.pm@...

 


Current high bug count owners for Yocto Project 3.4

Stephen Jolley
 

All,

Below is the list as of top 50 bug owners as of the end of WW41 of who have open medium or higher bugs and enhancements against YP 3.4.   There are 13 possible work days left until the final release candidates for YP 3.4 needs to be released.

Who

Count

michael.opdenacker@...

34

ross@...

30

david.reyna@...

22

randy.macleod@...

16

trevor.gamblin@...

14

bruce.ashfield@...

11

richard.purdie@...

10

timothy.t.orling@...

9

kai.kang@...

7

bluelightning@...

6

mhalstead@...

5

kiran.surendran@...

4

JPEWhacker@...

4

Qi.Chen@...

4

hongxu.jia@...

3

chee.yang.lee@...

3

thomas.perrot@...

2

akuster808@...

2

mingli.yu@...

2

mshah@...

2

saul.wold@...

2

raj.khem@...

1

tony.tascioglu@...

1

yi.zhao@...

1

sangeeta.jain@...

1

jay.shen.teoh@...

1

pokylinux@...

1

alexandre.belloni@...

1

alejandro@...

1

yf3yu@...

1

open.source@...

1

weaverjs@...

1

jaewon@...

1

fransmeulenbroeks@...

1

kergoth@...

1

mickael.laventure+yocto@...

1

ydirson@...

1

devendra.tewari@...

1

jeanmarie.lemetayer@...

1

diego.sueiro@...

1

aehs29@...

1

sakib.sajal@...

1

matthewzmd@...

1

douglas.royds@...

1

paul.gortmaker@...

1

paul@...

1

alex.kanavin@...

1

vinay.m.engg@...

1

shachar@...

1

pgowda.cve@...

1

mister_rs@...

1

Thanks,

 

Stephen K. Jolley

Yocto Project Program Manager

(    Cell:                (208) 244-4460

* Email:              sjolley.yp.pm@...

 


Yocto Project Newcomer & Unassigned Bugs - Help Needed

Stephen Jolley
 

All,

 

The triage team is starting to try and collect up and classify bugs which a newcomer to the project would be able to work on in a way which means people can find them. They're being listed on the triage page under the appropriate heading:

https://wiki.yoctoproject.org/wiki/Bug_Triage#Newcomer_Bugs  Also please review: https://www.openembedded.org/wiki/How_to_submit_a_patch_to_OpenEmbedded and how to create a bugzilla account at: https://bugzilla.yoctoproject.org/createaccount.cgi

The idea is these bugs should be straight forward for a person to help work on who doesn't have deep experience with the project.  If anyone can help, please take ownership of the bug and send patches!  If anyone needs help/advice there are people on irc who can likely do so, or some of the more experienced contributors will likely be happy to help too.

 

Also, the triage team meets weekly and does its best to handle the bugs reported into the Bugzilla. The number of people attending that meeting has fallen, as have the number of people available to help fix bugs. One of the things we hear users report is they don't know how to help. We (the triage team) are therefore going to start reporting out the currently 395 unassigned or newcomer bugs.

 

We're hoping people may be able to spare some time now and again to help out with these.  Bugs are split into two types, "true bugs" where things don't work as they should and "enhancements" which are features we'd want to add to the system.  There are also roughly four different "priority" classes right now, “3.4”, “3.5, "3.99" and "Future", the more pressing/urgent issues being in "3.4" and then “3.5”.

 

Please review this link and if a bug is something you would be able to help with either take ownership of the bug, or send me (sjolley.yp.pm@...) an e-mail with the bug number you would like and I will assign it to you (please make sure you have a Bugzilla account).  The list is at: https://wiki.yoctoproject.org/wiki/Bug_Triage_Archive#Unassigned_or_Newcomer_Bugs

 

Thanks,

 

Stephen K. Jolley

Yocto Project Program Manager

(    Cell:                (208) 244-4460

* Email:              sjolley.yp.pm@...

 


building the kernel's usbipd daemon

chuck kamas
 

Hi all,


I've googled most of the day, but to no avail. How does one compile and add to the image the daemon usbipd? Is there a bitbake file already for this? The code is part of the kernel found in the kernel tree:

KERNEL_SRC_PATH/tools/usb/usbip/src

and is invoked from the KERNEL_SRC_PATH/tools directory by calling

make usb


from: https://wiki.st.com/stm32mpu/wiki/How_to_build_Linux_kernel_user_space_tools

PC $> cd <Linux_kernel_source_path>/tools
PC $> make <tool>


I would think that there is a preexisting recipe.

thanks,

Chuck


Re: Yocto build error

Khem Raj
 

On Sun, Oct 10, 2021 at 6:45 PM JH <jupiter.hce@...> wrote:

Hi,

I have following errors:

No GNU_HASH in the ELF binary
/build/tmp-glibc/work/cortexa7t2hf-neon-oe-linux-gnueabi/solar/1.0.0-0/packages-split/wifi_signal,
didn't pass LDFLAGS? [ldflags]

So I add --hash-style=gnu to my Makefile:

LD_FLAGS += --hash-style=gnu
LDFLAGS = LD_FLAGS

But that does not work:

arm-oe-linux-gnueabi-gcc: error: unrecognized command line option
'--hash-style=gnu'

What is wrong about the error if the --hash-style=gnu is not the right fix?
So it seems your makefile is not respecting the LDFLAGS coming from
the environment during linking.
perhaps you should fix that in your linking rules. hardcoding hash
style like this is not portable.

Thank you.

Kind regards.

JH



QA notification for completed autobuilder build (yocto-3.4.rc1)

Richard Purdie
 

A build flagged for QA (yocto-3.4.rc1) was completed on the autobuilder and is available at:


https://autobuilder.yocto.io/pub/releases/yocto-3.4.rc1


Build hash information:

bitbake: c78ebac71ec976fdf27ea24767057882870f5c60
meta-agl: 228ecc1dec390138c44299d1c244acda9ad75ce1
meta-arm: 98193f3b6167e07cbb794e96b80d78ca1779ea4f
meta-aws: 27bca81c4d3f0138fda583f9ea98df6152332333
meta-gplv2: f04e4369bf9dd3385165281b9fa2ed1043b0e400
meta-intel: 90170cf85fe35b4e8dc00eee50053c0205276b63
meta-mingw: f5d761cbd5c957e4405c5d40b0c236d263c916a8
meta-openembedded: f2152d79043601eacb70da1a3ab36f5ac56f3e28
oecore: bb1dea6806f084364b6017db2567f438e805aef0
poky: f6d1126fff213460dc6954a5d5fc168606d76b66



This is an automated message from the Yocto Project Autobuilder
Git: git://git.yoctoproject.org/yocto-autobuilder2
Email: richard.purdie@...


[meta-zephyr][PATCH 2/2] zephyr-kernel/2.5.0: drop recipe

Naveen Saini
 

As v2.7.0 is being added, drop this version support

Signed-off-by: Naveen Saini <naveen.kumar.saini@...>
---
...phyr-2.5.0-cmake-add-yocto-toolchain.patch | 63 -------------------
.../zephyr-kernel/zephyr-kernel-src-2.5.0.inc | 17 -----
2 files changed, 80 deletions(-)
delete mode 100644 recipes-kernel/zephyr-kernel/files/0001-zephyr-2.5.0-cmake-add-yocto-toolchain.patch
delete mode 100644 recipes-kernel/zephyr-kernel/zephyr-kernel-src-2.5.0.inc

diff --git a/recipes-kernel/zephyr-kernel/files/0001-zephyr-2.5.0-cmake-add-yocto-toolchain.patch b/recipes-kernel/zephyr-kernel/files/0001-zephyr-2.5.0-cmake-add-yocto-toolchain.patch
deleted file mode 100644
index caab16f..0000000
--- a/recipes-kernel/zephyr-kernel/files/0001-zephyr-2.5.0-cmake-add-yocto-toolchain.patch
+++ /dev/null
@@ -1,63 +0,0 @@
-From 511745625637da0effca13c5489a392e15d32271 Mon Sep 17 00:00:00 2001
-From: Naveen Saini <naveen.kumar.saini@...>
-Date: Tue, 31 Mar 2020 13:22:17 +0800
-Subject: [PATCH] cmake: add yocto toolchain
-
-Upstream status: inappropriate [OE specific]
-
-Signed-off-by: Naveen Saini <naveen.kumar.saini@...>
----
- cmake/compiler/gcc/target.cmake | 7 -------
- cmake/toolchain/yocto/generic.cmake | 13 +++++++++++++
- cmake/toolchain/yocto/target.cmake | 1 +
- 3 files changed, 14 insertions(+), 7 deletions(-)
- create mode 100644 cmake/toolchain/yocto/generic.cmake
- create mode 100644 cmake/toolchain/yocto/target.cmake
-
-diff --git a/cmake/compiler/gcc/target.cmake b/cmake/compiler/gcc/target.cmake
-index 401cc28db8..5a026f4559 100644
---- a/cmake/compiler/gcc/target.cmake
-+++ b/cmake/compiler/gcc/target.cmake
-@@ -66,13 +66,6 @@ if(NOT no_libgcc)
- OUTPUT_STRIP_TRAILING_WHITESPACE
- )
-
-- assert_exists(LIBGCC_FILE_NAME)
--
-- get_filename_component(LIBGCC_DIR ${LIBGCC_FILE_NAME} DIRECTORY)
--
-- assert_exists(LIBGCC_DIR)
--
-- LIST(APPEND LIB_INCLUDE_DIR "-L\"${LIBGCC_DIR}\"")
- LIST(APPEND TOOLCHAIN_LIBS gcc)
- endif()
-
-diff --git a/cmake/toolchain/yocto/generic.cmake b/cmake/toolchain/yocto/generic.cmake
-new file mode 100644
-index 0000000000..45e5777e2a
---- /dev/null
-+++ b/cmake/toolchain/yocto/generic.cmake
-@@ -0,0 +1,13 @@
-+set(COMPILER gcc)
-+set(LINKER ld)
-+set(BINTOOLS gnu)
-+
-+set(ZEPHYR_SYSROOT ${ZEPHYR_SYSROOT})
-+set(SYSROOT_DIR ${ZEPHYR_SYSROOT})
-+set(LIBC_LIBRARY_DIR "\"${SYSROOT_DIR}\"/")
-+set(LIBC_INCLUDE_DIR ${SYSROOT_DIR}/include)
-+LIST(APPEND TOOLCHAIN_LIBS gcc)
-+
-+LIST(APPEND LIB_INCLUDE_DIR "-L\"${STAGING_LIBDIR}\"")
-+
-+set(TOOLCHAIN_LIBS gcc)
-diff --git a/cmake/toolchain/yocto/target.cmake b/cmake/toolchain/yocto/target.cmake
-new file mode 100644
-index 0000000000..9881313609
---- /dev/null
-+++ b/cmake/toolchain/yocto/target.cmake
-@@ -0,0 +1 @@
-+# SPDX-License-Identifier: Apache-2.0
---
-2.17.1
-
diff --git a/recipes-kernel/zephyr-kernel/zephyr-kernel-src-2.5.0.inc b/recipes-kernel/zephyr-kernel/zephyr-kernel-src-2.5.0.inc
deleted file mode 100644
index be75362..0000000
--- a/recipes-kernel/zephyr-kernel/zephyr-kernel-src-2.5.0.inc
+++ /dev/null
@@ -1,17 +0,0 @@
-SRCREV_FORMAT = "default_cmsis"
-SRCREV_default = "fe7c2efca800a0cf1bccf23aefe08b3c4beb88bf"
-SRCREV_cmsis = "c3bd2094f92d574377f7af2aec147ae181aa5f8e"
-SRCREV_nordic = "f3434da6446380fcdd426dbe2866af21d0d549b6"
-SRCREV_stm32 = "cc8731dba4fd9c57d7fe8ea6149828b89c2bd635"
-SRCREV_open-amp = "de1b85a13032a2de1d8b6695ae5f800b613e739d"
-SRCREV_openthread = "385e19da1ae15f27872c2543b97276a42f102ead"
-SRCREV_libmetal = "9d4ee2c3cfd5f49861939447990f3b7d7bf9bf94"
-SRCREV_tinycrypt = "3e9a49d2672ec01435ffbf0d788db6d95ef28de0"
-SRCREV_mbedtls = "24d84ecff195fb15c889d9046e44e4804d626c67"
-
-ZEPHYR_BRANCH = "main"
-PV = "2.5.0+git${SRCPV}"
-
-SRC_URI:append = " file://0001-zephyr-2.5.0-cmake-add-yocto-toolchain.patch \
- file://0001-x86-fix-efi-binary-generation-issue-in-cross-compila.patch \
- "
--
2.17.1

2801 - 2820 of 57800