Date   

Re: Node-red and Wifi

Josef Holzmayr
 

Brutally honest:

Yes it can. No you won't be able to do it without reading the docs.

<donald@...> schrieb am Mi., 13. Okt. 2021, 08:51:

I am looking at various distributions to move to from my existing one - without wanting to wade through another lots of documentation - can the Yocto buid
1) be configured to act as a WiFi access point - with natting
2) run node-red

I will be running on an Armbian quadcore.



Node-red and Wifi

donald@...
 

I am looking at various distributions to move to from my existing one - without wanting to wade through another lots of documentation - can the Yocto buid
1) be configured to act as a WiFi access point - with natting
2) run node-red

I will be running on an Armbian quadcore.


Re: [qa-build-notification] QA notification for completed autobuilder build (yocto-3.4.rc1)

Teoh, Jay Shen
 

Hi all,

Intel and WR YP QA is planning for QA execution for YP build yocto-3.4.rc1. We are planning to execute following tests for this cycle:

OEQA-manual tests for following module:
1. OE-Core
2. BSP-hw

Runtime auto test for following platforms:
1. MinnowTurbot 32-bit
2. Coffee Lake
3. NUC 7
4. NUC 6
5. Edgerouter
6. Beaglebone

ETA for completion is next Monday, Oct 18.

Thanks,
Jay

-----Original Message-----
From: qa-build-notification@... <qa-build-
notification@...> On Behalf Of Richard Purdie
Sent: Tuesday, 12 October, 2021 1:25 AM
To: yocto@...
Cc: qa-build-notification <qa-build-notification@...>
Subject: [qa-build-notification] QA notification for completed autobuilder build
(yocto-3.4.rc1)

A build flagged for QA (yocto-3.4.rc1) was completed on the autobuilder and is
available at:


https://autobuilder.yocto.io/pub/releases/yocto-3.4.rc1


Build hash information:

bitbake: c78ebac71ec976fdf27ea24767057882870f5c60
meta-agl: 228ecc1dec390138c44299d1c244acda9ad75ce1
meta-arm: 98193f3b6167e07cbb794e96b80d78ca1779ea4f
meta-aws: 27bca81c4d3f0138fda583f9ea98df6152332333
meta-gplv2: f04e4369bf9dd3385165281b9fa2ed1043b0e400
meta-intel: 90170cf85fe35b4e8dc00eee50053c0205276b63
meta-mingw: f5d761cbd5c957e4405c5d40b0c236d263c916a8
meta-openembedded: f2152d79043601eacb70da1a3ab36f5ac56f3e28
oecore: bb1dea6806f084364b6017db2567f438e805aef0
poky: f6d1126fff213460dc6954a5d5fc168606d76b66



This is an automated message from the Yocto Project Autobuilder
Git: git://git.yoctoproject.org/yocto-autobuilder2
Email: richard.purdie@...







Re: util-linux and --enable-raw with recent kernels

Federico Pellegrin
 


Thanks Khem!
Indeed I checked on master but got cheated by the web git interface and I was looking at an older commit :-/
Glad it is the right way to go and already solved on master!

Cheers,
Federico


Il giorno mar 12 ott 2021 alle ore 18:55 Khem Raj <raj.khem@...> ha scritto:


On 10/12/21 9:27 AM, Federico Pellegrin wrote:
>
> Hello,
> Running on a quite recent kernel (5.14.10 from Fedora 34) I've came
> across a problem when building util-linux (2.35.2) native, namely in the
> configure phase:
>
> configure: error: raw selected, but required raw.h header file not available
>

you might want to use latest master, fix that you might find useful is

https://git.openembedded.org/openembedded-core/commit/?id=7f577c10913104860121f682b9b3754870c4db23

> After a bit or research I believe it is due to:
> https://www.mail-archive.com/debian-bugs-dist@.../msg1820154.html
> <https://www.mail-archive.com/debian-bugs-dist@.../msg1820154.html>
>
> Which is related to the change in the recent kernels here:
> https://github.com/torvalds/linux/commit/603e4922f1c81fc2ed3a87b4f91a8d3aafc7e093#diff-10d697dff14540ee1eb6539dcc53b2b88844b6187c1995c0698ba0936754304a
> <https://github.com/torvalds/linux/commit/603e4922f1c81fc2ed3a87b4f91a8d3aafc7e093#diff-10d697dff14540ee1eb6539dcc53b2b88844b6187c1995c0698ba0936754304a>
> where the raw.h file was indeed removed.
>
> As per first link it may not be obvious to fix, and don't see an
> upstream fix for it, but from the Yocto perspective my current
> workaround is basically just to remove "--enable-raw" from the
> EXTRA_OECONF to disable the raw feature.
>
> While the whole image seemed to build fine with this, I'm not very sure
> if that configuration option had a precise use (which maybe it's being
> skipping in my specific build) or not, so I wanted to ask the experts if
> there is any opinion on this and/or should I do a merge request that
> removes it to handle this problem, at least until there is a better
> solution upstream in util-linux?
>
> Many thanks,
> Federico
>
>
>
>


Re: #zeus meta-intel #zeus

Anuj Mittal
 

Did you build everything with this compiler from start? Is opencl-clang
building with the right LLVM lib from meta-clang?

Thanks,

Anuj

On Tue, 2021-10-12 at 17:15 +0000, Monsees, Steven C (US) wrote:

Anuj:

I picked up the tarball for for the baseline dunfell tools platform to
update host tools...

I am seeing it compile cleaner but for one issue causng ld to fail:

/disk0/scratch/smonsees/yocto/workspace_1/builds2/sbcb-
default/tmp/work/x86_64-linux/intel-graphics-compiler-native/1.0.11-
r0/recipe-sysroot-native/usr/include/llvm/Support/CommandLine.h:1331:
undefined reference to `vtable for
llvm::cl::opt<std::__cxx11::basic_string<char, std::char_traits<char>,
std::allocator<char> >, false,
llvm::cl::parser<std::__cxx11::basic_string<char,
std::char_traits<char>, std::allocator<char> > > >'

Isn't LLVM brought in along with clang under meta-clang ?

Is there a missing build dependency ?

Thanks,
Steve

Build excerpt showing multiple " undefined reference to `vtable "
errors...

/opt/poky/3.1.3/sysroots/x86_64-pokysdk-linux/usr/lib/gcc/x86_64-
pokysdk-linux/9.3.0/../../../../x86_64-pokysdk-linux/bin/ld:
IGC/ElfPackager/CMakeFiles/elf_packager.dir/main.cpp.o: in function
`llvm::cl::opt<std::__cxx11::basic_string<char, std::char_traits<char>,
std::allocator<char> >, false,
llvm::cl::parser<std::__cxx11::basic_string<char,
std::char_traits<char>, std::allocator<char> > > >::~opt()':
/disk0/scratch/smonsees/yocto/workspace_1/builds2/sbcb-
default/tmp/work/x86_64-linux/intel-graphics-compiler-native/1.0.11-
r0/recipe-sysroot-native/usr/include/llvm/Support/CommandLine.h:1331:
undefined reference to `vtable for
llvm::cl::opt<std::__cxx11::basic_string<char, std::char_traits<char>,
std::allocator<char> >, false,
llvm::cl::parser<std::__cxx11::basic_string<char,
std::char_traits<char>, std::allocator<char> > > >'
/opt/poky/3.1.3/sysroots/x86_64-pokysdk-linux/usr/lib/gcc/x86_64-
pokysdk-linux/9.3.0/../../../../x86_64-pokysdk-linux/bin/ld:
IGC/ElfPackager/CMakeFiles/elf_packager.dir/main.cpp.o: in function
`llvm::cl::OptionValue<std::__cxx11::basic_string<char,
std::char_traits<char>, std::allocator<char> > >::OptionValue()':
/disk0/scratch/smonsees/yocto/workspace_1/builds2/sbcb-
default/tmp/work/x86_64-linux/intel-graphics-compiler-native/1.0.11-
r0/recipe-sysroot-native/usr/include/llvm/Support/CommandLine.h:601:
undefined reference to `vtable for
llvm::cl::OptionValue<std::__cxx11::basic_string<char,
std::char_traits<char>, std::allocator<char> > >'
/opt/poky/3.1.3/sysroots/x86_64-pokysdk-linux/usr/lib/gcc/x86_64-
pokysdk-linux/9.3.0/../../../../x86_64-pokysdk-linux/bin/ld:
IGC/ElfPackager/CMakeFiles/elf_packager.dir/main.cpp.o: in function
`llvm::cl::opt<std::__cxx11::basic_string<char, std::char_traits<char>,
std::allocator<char> >, false,
llvm::cl::parser<std::__cxx11::basic_string<char,
std::char_traits<char>, std::allocator<char> > >
::opt<llvm::cl::FormattingFlags, llvm::cl::desc,
llvm::cl::initializer<char [2]> >(llvm::cl::FormattingFlags const&,
llvm::cl::desc const&, llvm::cl::initializer<char [2]> const&)':
/disk0/scratch/smonsees/yocto/workspace_1/builds2/sbcb-
default/tmp/work/x86_64-linux/intel-graphics-compiler-native/1.0.11-
r0/recipe-sysroot-native/usr/include/llvm/Support/CommandLine.h:1407:
undefined reference to `vtable for
llvm::cl::opt<std::__cxx11::basic_string<char, std::char_traits<char>,
std::allocator<char> >, false,
llvm::cl::parser<std::__cxx11::basic_string<char,
std::char_traits<char>, std::allocator<char> > > >'
/opt/poky/3.1.3/sysroots/x86_64-pokysdk-linux/usr/lib/gcc/x86_64-
pokysdk-linux/9.3.0/../../../../x86_64-pokysdk-linux/bin/ld:
IGC/ElfPackager/CMakeFiles/elf_packager.dir/main.cpp.o: in function
`llvm::cl::parser<std::__cxx11::basic_string<char,
std::char_traits<char>, std::allocator<char> >
::parser(llvm::cl::Option&)':
/disk0/scratch/smonsees/yocto/workspace_1/builds2/sbcb-
default/tmp/work/x86_64-linux/intel-graphics-compiler-native/1.0.11-
r0/recipe-sysroot-native/usr/include/llvm/Support/CommandLine.h:1072:
undefined reference to `vtable for
llvm::cl::parser<std::__cxx11::basic_string<char,
std::char_traits<char>, std::allocator<char> > >'
/opt/poky/3.1.3/sysroots/x86_64-pokysdk-linux/usr/lib/gcc/x86_64-
pokysdk-linux/9.3.0/../../../../x86_64-pokysdk-linux/bin/ld:
IGC/ElfPackager/CMakeFiles/elf_packager.dir/main.cpp.o: in function
`llvm::cl::opt<std::__cxx11::basic_string<char, std::char_traits<char>,
std::allocator<char> >, false,
llvm::cl::parser<std::__cxx11::basic_string<char,
std::char_traits<char>, std::allocator<char> > > >::~opt()':
/disk0/scratch/smonsees/yocto/workspace_1/builds2/sbcb-
default/tmp/work/x86_64-linux/intel-graphics-compiler-native/1.0.11-
r0/recipe-sysroot-native/usr/include/llvm/Support/CommandLine.h:1331:
undefined reference to `vtable for
llvm::cl::opt<std::__cxx11::basic_string<char, std::char_traits<char>,
std::allocator<char> >, false,
llvm::cl::parser<std::__cxx11::basic_string<char,
std::char_traits<char>, std::allocator<char> > > >'
/opt/poky/3.1.3/sysroots/x86_64-pokysdk-linux/usr/lib/gcc/x86_64-
pokysdk-linux/9.3.0/../../../../x86_64-pokysdk-linux/bin/ld:
IGC/ElfPackager/CMakeFiles/elf_packager.dir/main.cpp.o: in function
`llvm::cl::OptionValue<std::__cxx11::basic_string<char,
std::char_traits<char>, std::allocator<char> > >::OptionValue()':
/disk0/scratch/smonsees/yocto/workspace_1/builds2/sbcb-
default/tmp/work/x86_64-linux/intel-graphics-compiler-native/1.0.11-
r0/recipe-sysroot-native/usr/include/llvm/Support/CommandLine.h:601:
undefined reference to `vtable for
llvm::cl::OptionValue<std::__cxx11::basic_string<char,
std::char_traits<char>, std::allocator<char> > >'
/opt/poky/3.1.3/sysroots/x86_64-pokysdk-linux/usr/lib/gcc/x86_64-
pokysdk-linux/9.3.0/../../../../x86_64-pokysdk-linux/bin/ld:
IGC/ElfPackager/CMakeFiles/elf_packager.dir/main.cpp.o: in function
`llvm::cl::opt<std::__cxx11::basic_string<char, std::char_traits<char>,
std::allocator<char> >, false,
llvm::cl::parser<std::__cxx11::basic_string<char,
std::char_traits<char>, std::allocator<char> > > >::opt<char [9],
llvm::cl::desc>(char const (&) [9], llvm::cl::desc const&)':
/disk0/scratch/smonsees/yocto/workspace_1/builds2/sbcb-
default/tmp/work/x86_64-linux/intel-graphics-compiler-native/1.0.11-
r0/recipe-sysroot-native/usr/include/llvm/Support/CommandLine.h:1407:
undefined reference to `vtable for
llvm::cl::opt<std::__cxx11::basic_string<char, std::char_traits<char>,
std::allocator<char> >, false,
llvm::cl::parser<std::__cxx11::basic_string<char,
std::char_traits<char>, std::allocator<char> > > >'
/opt/poky/3.1.3/sysroots/x86_64-pokysdk-linux/usr/lib/gcc/x86_64-
pokysdk-linux/9.3.0/../../../../x86_64-pokysdk-linux/bin/ld:
IGC/ElfPackager/CMakeFiles/elf_packager.dir/main.cpp.o: in function
`llvm::cl::parser<std::__cxx11::basic_string<char,
std::char_traits<char>, std::allocator<char> >
::parser(llvm::cl::Option&)':
/disk0/scratch/smonsees/yocto/workspace_1/builds2/sbcb-
default/tmp/work/x86_64-linux/intel-graphics-compiler-native/1.0.11-
r0/recipe-sysroot-native/usr/include/llvm/Support/CommandLine.h:1072:
undefined reference to `vtable for
llvm::cl::parser<std::__cxx11::basic_string<char,
std::char_traits<char>, std::allocator<char> > >'
collect2: error: ld returned 1 exit status

-----Original Message-----
From: yocto@... <yocto@...> On
Behalf Of Anuj Mittal
Sent: Tuesday, October 12, 2021 10:43 AM
To: Monsees, Steven C (US) <steven.monsees@...>;
yocto@...
Subject: Re: [yocto] #zeus meta-intel

External Email Alert

This email has been sent from an account outside of the BAE Systems
network.

Please treat the email with caution, especially if you are requested to
click on a link, decrypt/open an attachment, or enable macros.  For
further information on how to spot phishing, access “Cybersecurity
OneSpace Page” and report phishing by clicking the button “Report
Phishing” on the Outlook toolbar.


On Tue, 2021-10-12 at 12:43 +0000, Monsees, Steven C (US) wrote:
g++: error: unrecognized command line option ‘-std=c++14’
It looks like the gcc version is too old on your host for this to work.

Thanks,

Anuj


Re: #zeus meta-intel #zeus

Monsees, Steven C (US)
 

Anuj:

I picked up the tarball for for the baseline dunfell tools platform to update host tools...

I am seeing it compile cleaner but for one issue causng ld to fail:

/disk0/scratch/smonsees/yocto/workspace_1/builds2/sbcb-default/tmp/work/x86_64-linux/intel-graphics-compiler-native/1.0.11-r0/recipe-sysroot-native/usr/include/llvm/Support/CommandLine.h:1331: undefined reference to `vtable for llvm::cl::opt<std::__cxx11::basic_string<char, std::char_traits<char>, std::allocator<char> >, false, llvm::cl::parser<std::__cxx11::basic_string<char, std::char_traits<char>, std::allocator<char> > > >'

Isn't LLVM brought in along with clang under meta-clang ?

Is there a missing build dependency ?

Thanks,
Steve

Build excerpt showing multiple " undefined reference to `vtable " errors...

/opt/poky/3.1.3/sysroots/x86_64-pokysdk-linux/usr/lib/gcc/x86_64-pokysdk-linux/9.3.0/../../../../x86_64-pokysdk-linux/bin/ld: IGC/ElfPackager/CMakeFiles/elf_packager.dir/main.cpp.o: in function `llvm::cl::opt<std::__cxx11::basic_string<char, std::char_traits<char>, std::allocator<char> >, false, llvm::cl::parser<std::__cxx11::basic_string<char, std::char_traits<char>, std::allocator<char> > > >::~opt()':
/disk0/scratch/smonsees/yocto/workspace_1/builds2/sbcb-default/tmp/work/x86_64-linux/intel-graphics-compiler-native/1.0.11-r0/recipe-sysroot-native/usr/include/llvm/Support/CommandLine.h:1331: undefined reference to `vtable for llvm::cl::opt<std::__cxx11::basic_string<char, std::char_traits<char>, std::allocator<char> >, false, llvm::cl::parser<std::__cxx11::basic_string<char, std::char_traits<char>, std::allocator<char> > > >'
/opt/poky/3.1.3/sysroots/x86_64-pokysdk-linux/usr/lib/gcc/x86_64-pokysdk-linux/9.3.0/../../../../x86_64-pokysdk-linux/bin/ld: IGC/ElfPackager/CMakeFiles/elf_packager.dir/main.cpp.o: in function `llvm::cl::OptionValue<std::__cxx11::basic_string<char, std::char_traits<char>, std::allocator<char> > >::OptionValue()':
/disk0/scratch/smonsees/yocto/workspace_1/builds2/sbcb-default/tmp/work/x86_64-linux/intel-graphics-compiler-native/1.0.11-r0/recipe-sysroot-native/usr/include/llvm/Support/CommandLine.h:601: undefined reference to `vtable for llvm::cl::OptionValue<std::__cxx11::basic_string<char, std::char_traits<char>, std::allocator<char> > >'
/opt/poky/3.1.3/sysroots/x86_64-pokysdk-linux/usr/lib/gcc/x86_64-pokysdk-linux/9.3.0/../../../../x86_64-pokysdk-linux/bin/ld: IGC/ElfPackager/CMakeFiles/elf_packager.dir/main.cpp.o: in function `llvm::cl::opt<std::__cxx11::basic_string<char, std::char_traits<char>, std::allocator<char> >, false, llvm::cl::parser<std::__cxx11::basic_string<char, std::char_traits<char>, std::allocator<char> > > >::opt<llvm::cl::FormattingFlags, llvm::cl::desc, llvm::cl::initializer<char [2]> >(llvm::cl::FormattingFlags const&, llvm::cl::desc const&, llvm::cl::initializer<char [2]> const&)':
/disk0/scratch/smonsees/yocto/workspace_1/builds2/sbcb-default/tmp/work/x86_64-linux/intel-graphics-compiler-native/1.0.11-r0/recipe-sysroot-native/usr/include/llvm/Support/CommandLine.h:1407: undefined reference to `vtable for llvm::cl::opt<std::__cxx11::basic_string<char, std::char_traits<char>, std::allocator<char> >, false, llvm::cl::parser<std::__cxx11::basic_string<char, std::char_traits<char>, std::allocator<char> > > >'
/opt/poky/3.1.3/sysroots/x86_64-pokysdk-linux/usr/lib/gcc/x86_64-pokysdk-linux/9.3.0/../../../../x86_64-pokysdk-linux/bin/ld: IGC/ElfPackager/CMakeFiles/elf_packager.dir/main.cpp.o: in function `llvm::cl::parser<std::__cxx11::basic_string<char, std::char_traits<char>, std::allocator<char> > >::parser(llvm::cl::Option&)':
/disk0/scratch/smonsees/yocto/workspace_1/builds2/sbcb-default/tmp/work/x86_64-linux/intel-graphics-compiler-native/1.0.11-r0/recipe-sysroot-native/usr/include/llvm/Support/CommandLine.h:1072: undefined reference to `vtable for llvm::cl::parser<std::__cxx11::basic_string<char, std::char_traits<char>, std::allocator<char> > >'
/opt/poky/3.1.3/sysroots/x86_64-pokysdk-linux/usr/lib/gcc/x86_64-pokysdk-linux/9.3.0/../../../../x86_64-pokysdk-linux/bin/ld: IGC/ElfPackager/CMakeFiles/elf_packager.dir/main.cpp.o: in function `llvm::cl::opt<std::__cxx11::basic_string<char, std::char_traits<char>, std::allocator<char> >, false, llvm::cl::parser<std::__cxx11::basic_string<char, std::char_traits<char>, std::allocator<char> > > >::~opt()':
/disk0/scratch/smonsees/yocto/workspace_1/builds2/sbcb-default/tmp/work/x86_64-linux/intel-graphics-compiler-native/1.0.11-r0/recipe-sysroot-native/usr/include/llvm/Support/CommandLine.h:1331: undefined reference to `vtable for llvm::cl::opt<std::__cxx11::basic_string<char, std::char_traits<char>, std::allocator<char> >, false, llvm::cl::parser<std::__cxx11::basic_string<char, std::char_traits<char>, std::allocator<char> > > >'
/opt/poky/3.1.3/sysroots/x86_64-pokysdk-linux/usr/lib/gcc/x86_64-pokysdk-linux/9.3.0/../../../../x86_64-pokysdk-linux/bin/ld: IGC/ElfPackager/CMakeFiles/elf_packager.dir/main.cpp.o: in function `llvm::cl::OptionValue<std::__cxx11::basic_string<char, std::char_traits<char>, std::allocator<char> > >::OptionValue()':
/disk0/scratch/smonsees/yocto/workspace_1/builds2/sbcb-default/tmp/work/x86_64-linux/intel-graphics-compiler-native/1.0.11-r0/recipe-sysroot-native/usr/include/llvm/Support/CommandLine.h:601: undefined reference to `vtable for llvm::cl::OptionValue<std::__cxx11::basic_string<char, std::char_traits<char>, std::allocator<char> > >'
/opt/poky/3.1.3/sysroots/x86_64-pokysdk-linux/usr/lib/gcc/x86_64-pokysdk-linux/9.3.0/../../../../x86_64-pokysdk-linux/bin/ld: IGC/ElfPackager/CMakeFiles/elf_packager.dir/main.cpp.o: in function `llvm::cl::opt<std::__cxx11::basic_string<char, std::char_traits<char>, std::allocator<char> >, false, llvm::cl::parser<std::__cxx11::basic_string<char, std::char_traits<char>, std::allocator<char> > > >::opt<char [9], llvm::cl::desc>(char const (&) [9], llvm::cl::desc const&)':
/disk0/scratch/smonsees/yocto/workspace_1/builds2/sbcb-default/tmp/work/x86_64-linux/intel-graphics-compiler-native/1.0.11-r0/recipe-sysroot-native/usr/include/llvm/Support/CommandLine.h:1407: undefined reference to `vtable for llvm::cl::opt<std::__cxx11::basic_string<char, std::char_traits<char>, std::allocator<char> >, false, llvm::cl::parser<std::__cxx11::basic_string<char, std::char_traits<char>, std::allocator<char> > > >'
/opt/poky/3.1.3/sysroots/x86_64-pokysdk-linux/usr/lib/gcc/x86_64-pokysdk-linux/9.3.0/../../../../x86_64-pokysdk-linux/bin/ld: IGC/ElfPackager/CMakeFiles/elf_packager.dir/main.cpp.o: in function `llvm::cl::parser<std::__cxx11::basic_string<char, std::char_traits<char>, std::allocator<char> > >::parser(llvm::cl::Option&)':
/disk0/scratch/smonsees/yocto/workspace_1/builds2/sbcb-default/tmp/work/x86_64-linux/intel-graphics-compiler-native/1.0.11-r0/recipe-sysroot-native/usr/include/llvm/Support/CommandLine.h:1072: undefined reference to `vtable for llvm::cl::parser<std::__cxx11::basic_string<char, std::char_traits<char>, std::allocator<char> > >'
collect2: error: ld returned 1 exit status

-----Original Message-----
From: yocto@... <yocto@...> On Behalf Of Anuj Mittal
Sent: Tuesday, October 12, 2021 10:43 AM
To: Monsees, Steven C (US) <steven.monsees@...>; yocto@...
Subject: Re: [yocto] #zeus meta-intel

External Email Alert

This email has been sent from an account outside of the BAE Systems network.

Please treat the email with caution, especially if you are requested to click on a link, decrypt/open an attachment, or enable macros. For further information on how to spot phishing, access “Cybersecurity OneSpace Page” and report phishing by clicking the button “Report Phishing” on the Outlook toolbar.


On Tue, 2021-10-12 at 12:43 +0000, Monsees, Steven C (US) wrote:
g++: error: unrecognized command line option ‘-std=c++14’
It looks like the gcc version is too old on your host for this to work.

Thanks,

Anuj


Re: util-linux and --enable-raw with recent kernels

Khem Raj
 

On 10/12/21 9:27 AM, Federico Pellegrin wrote:
Hello,
Running on a quite recent kernel (5.14.10 from Fedora 34) I've came across a problem when building util-linux (2.35.2) native, namely in the configure phase:
configure: error: raw selected, but required raw.h header file not available
you might want to use latest master, fix that you might find useful is

https://git.openembedded.org/openembedded-core/commit/?id=7f577c10913104860121f682b9b3754870c4db23

After a bit or research I believe it is due to:
https://www.mail-archive.com/debian-bugs-dist@lists.debian.org/msg1820154.html <https://www.mail-archive.com/debian-bugs-dist@lists.debian.org/msg1820154.html>
Which is related to the change in the recent kernels here:
https://github.com/torvalds/linux/commit/603e4922f1c81fc2ed3a87b4f91a8d3aafc7e093#diff-10d697dff14540ee1eb6539dcc53b2b88844b6187c1995c0698ba0936754304a <https://github.com/torvalds/linux/commit/603e4922f1c81fc2ed3a87b4f91a8d3aafc7e093#diff-10d697dff14540ee1eb6539dcc53b2b88844b6187c1995c0698ba0936754304a>
where the raw.h file was indeed removed.
As per first link it may not be obvious to fix, and don't see an upstream fix for it, but from the Yocto perspective my current workaround is basically just to remove "--enable-raw" from the EXTRA_OECONF to disable the raw feature.
While the whole image seemed to build fine with this, I'm not very sure if that configuration option had a precise use (which maybe it's being skipping in my specific build) or not, so I wanted to ask the experts if there is any opinion on this and/or should I do a merge request that removes it to handle this problem, at least until there is a better solution upstream in util-linux?
Many thanks,
Federico


util-linux and --enable-raw with recent kernels

Federico Pellegrin
 


Hello,
Running on a quite recent kernel (5.14.10 from Fedora 34) I've came across a problem when building util-linux (2.35.2) native, namely in the configure phase:

configure: error: raw selected, but required raw.h header file not available

After a bit or research I believe it is due to:

Which is related to the change in the recent kernels here:
where the raw.h file was indeed removed.

As per first link it may not be obvious to fix, and don't see an upstream fix for it, but from the Yocto perspective my current workaround is basically just to remove "--enable-raw" from the EXTRA_OECONF to disable the raw feature.

While the whole image seemed to build fine with this, I'm not very sure if that configuration option had a precise use (which maybe it's being skipping in my specific build) or not, so I wanted to ask the experts if there is any opinion on this and/or should I do a merge request that removes it to handle this problem, at least until there is a better solution upstream in util-linux?

Many thanks,
Federico


Yocto Project Status WW41`21

Stephen Jolley
 

Current Dev Position: YP 3.4 M4

Next Deadline: 29th Oct. 2021 YP 3.4 M4 release

 

Next Team Meetings:

 

Key Status/Updates:

  • YP 3.4 rc1 has been built and is heading to QA
  • Patches to master for post-release have started merging, there is a significant queue.
  • CVEs open against master have taken a small but worrying uptick this week.
  • There were some last minute changes to the hash equivalence server around the algorithm used for handling the hashes to try and ensure we get the reuse of sstate objects users would expect. These did delay the release but we believe this was worth doing to allow best use of sstate caches.
  • There were other key changes to the task reproducibility and to the task outhash generation which were included in the release. These should also significantly improve hash equivalence matching and artefact reuse.
  • Intermittent issues continue to rise, some seem to be issues coming from the newer distros we’ve added to the autobuilder (Centos 8 stream, Fedora 34 and Debian 11). Help is very much welcome on these issues. You can see the list of failures we’re continuing to see by searching for the “AB-INT” tag in bugzilla: https://bugzilla.yoctoproject.org/buglist.cgi?quicksearch=AB-INT

 

Ways to contribute:

 

YP 3.4 Milestone Dates:

  • YP 3.4 M4 is in QA
  • YP 3.4 M4 Release date 2021/10/29

 

Tracking Metrics:

 

The Yocto Project’s technical governance is through its Technical Steering Committee, more information is available at:

https://wiki.yoctoproject.org/wiki/TSC

 

The Status reports are now stored on the wiki at: https://wiki.yoctoproject.org/wiki/Weekly_Status

 

[If anyone has suggestions for other information you’d like to see on this weekly status update, let us know!]

 

Thanks,

 

Stephen K. Jolley

Yocto Project Program Manager

(    Cell:                (208) 244-4460

* Email:              sjolley.yp.pm@...

 


Re: #zeus meta-intel #zeus

Anuj Mittal
 

On Tue, 2021-10-12 at 12:43 +0000, Monsees, Steven C (US) wrote:
g++: error: unrecognized command line option ‘-std=c++14’
It looks like the gcc version is too old on your host for this to work.

Thanks,

Anuj


Re: How to include PostgreSQL development stuff in SDK?

tboeckel
 

Can anybody please help me with this issue? I am completely out of ideas what I am missing or doing wrong.

Mit freundlichem Gruß
best regards

iNOEX GmbH
Thore Böckelmann
Software Design

Mit freundlichen Grüßen / Kind regards 
i. A. Thore Böckelmann

 

iNOEX GmbH | Maschweg 70 | 49324 Melle | Germany | www.inoex.de

Dipl.-Inform. Thore Böckelmann
Software Engineering
thore.boeckelmann@...

FON +49 5422 60507-958 | FAX +49 5422 60507-101

 


iNOEX GmbH
Innovationen und Ausruestungen fuer die Extrusionstechnik

Geschaeftsfuehrer / Managing Director: Martin Deters, Jan Lohoff 
Sitz der Gesellschaft / Headquarter: Maschweg 70, D-49324 Melle
Registergericht / Register: Amtsgericht Osnabrück
Handelsregisternummer / Registration number: HRB 207338

Bitte beachten Sie die Datenschutzinformationen


Von: Böckelmann, Thore <thore.boeckelmann@...>
Gesendet: Samstag, 2. Oktober 2021 17:10
An: yocto@... <yocto@...>
Betreff: How to include PostgreSQL development stuff in SDK?
 
Hi everybody!

I successfully built an image for an ARM based system running a PostgreSQL server and client by adding the packages "postgresql" and "postgresql-client". However, so far I failed to make the development stuff (libpq-fe.h, pg_config, etc) available in the generated SDK.

Usuallly one uses pg_config to obtain the required include path (pg_config --includedir), the required compiler flags for C and C++ (pg_config --cflags and pg_config --cppflags) as well as the required linker flags (pg_config --libdir and pg_config --ldflags). However, I get the warning during compilation of my own programs:

cc1plus: warning: include location "/usr/include/postgresql" is unsafe for cross-compilation [-Wpoison-system-directories]

Obviously the native pg_config binary of my Ubuntu system is called and hence causes references to the local installation of the libpq-dev package of my Ubuntu system instead of a pg_config binary provided by the SDK. Even worse, the SDK just includes the pg_config binary for the ARM platform, but not for x86_64.

The only way to silence these warnings is to include -Wno-poison-system-directories in my compiler flags. But this is something I really like to avoid. Who knows whether the PostgreSQL development stuff of my local Ubuntu system will always be compatible to the one for the ARM system?

Unfortunately I had no luck including the PostgreSQL development stuff in the SDK. I already tried 'TOOLCHAIN_HOST_TASK_append = " nativesdk-postgresql"', but this ends in an error message like this:

ERROR: Nothing RPROVIDES 'nativesdk-postgresql' (but /opt/PHYTEC_BSPs/yocto_imx7/sources/poky/meta/recipes-core/meta/buildtools-tarball.bb, /opt/PHYTEC_BSPs/yocto_imx7/sources/poky/meta/recipes-core/meta/uninative-tarball.bb RDEPENDS on or otherwise requires it)
NOTE: Runtime target 'nativesdk-postgresql' is unbuildable, removing...
Missing or unbuildable dependency chain was: ['nativesdk-postgresql']
ERROR: Required build target 'fsl-image-qt5' has no buildable providers.
Missing or unbuildable dependency chain was: ['fsl-image-qt5', 'buildtools-tarball', 'nativesdk-postgresql']

Adding 'PACKAGECONFIG_append_pn-nativesdk += " postgresql"' also does not cause the x86_64 binary of pg_config to be included in the SDK. I assume this causes the ARM binary to be included, but this cannot be used on an x86_64 system.

I searched lots of sites for a solution already, but so far I only found hints how to add packages in general, but nothing in respect to this specific issue.

Can anybody please point out what I am doing wrong or what I need to change to solve this issue?

Many thanks in advance!

Mit freundlichem Gruß
best regards

iNOEX GmbH
Thore Böckelmann
Software Design

Mit freundlichen Grüßen / Kind regards 
i. A. Thore Böckelmann

 

iNOEX GmbH | Maschweg 70 | 49324 Melle | Germany | www.inoex.de

Dipl.-Inform. Thore Böckelmann
Software Engineering
thore.boeckelmann@...

FON +49 5422 60507-958 | FAX +49 5422 60507-101

 

Follow us on   

 


iNOEX GmbH
Innovationen und Ausruestungen fuer die Extrusionstechnik

Geschaeftsfuehrer / Managing Director: Martin Deters, Jan Lohoff 
Sitz der Gesellschaft / Headquarter: Maschweg 70, D-49324 Melle
Registergericht / Register: Amtsgericht Osnabrück
Handelsregisternummer / Registration number: HRB 207338

Bitte beachten Sie die Datenschutzinformationen


Re: building the kernel's usbipd daemon

Bruce Ashfield
 

On Tue, Oct 12, 2021 at 12:33 AM chuck kamas via
lists.yoctoproject.org <chuckkamas=yahoo.com@...>
wrote:

Thanks for the quick reply. I looked at the perf recipe, and its quite involved. Is there a simpler recipie to use as a template? Perhaps one of these?
My intent was just to show how you'd get the source from whatever
kernel you are building,

meta-openembedded/meta-oe/recipes-kernel/bpftool/bpftool.bb

meta-openembedded/meta-oe/recipes-kernel/spidev-test/spidev-test.bb

meta-openembedded/meta-oe/recipes-kernel/cpupower/cpupower.bb


all three of these appear to be basically the same very simple bb file.
Assuming that you don't need to patch the sources directly, any of
those would likely work ... depending on the dependencies and options
of what tool you are building.

Bruce


Chuck


On 10/11/21 5:46 PM, Bruce Ashfield wrote:

On Mon, Oct 11, 2021 at 6:16 PM chuck kamas via lists.yoctoproject.org
<chuckkamas=yahoo.com@...> wrote:

Hi all,


I've googled most of the day, but to no avail. How does one compile and
add to the image the daemon usbipd? Is there a bitbake file already for
this? The code is part of the kernel found in the kernel tree:

KERNEL_SRC_PATH/tools/usb/usbip/src

and is invoked from the KERNEL_SRC_PATH/tools directory by calling

make usb


from:
https://wiki.st.com/stm32mpu/wiki/How_to_build_Linux_kernel_user_space_tools

PC $> cd <Linux_kernel_source_path>/tools
PC $> make <tool>


I would think that there is a preexisting recipe.

There isn't one that I've ever heard of, and the layerindex
(http://layers.openembedded.org/) confirms that nothing registered
with it provides that recipe.

So if you need it, you'd have to create a recipe .. and submit it to
somewhere like meta-openembedded if appropriate.

Have a look at the perf recipe for one of the ways we build tools out
of the kernel source. Something similar will work in this case.

Bruce

thanks,

Chuck












--
- Thou shalt not follow the NULL pointer, for chaos and madness await
thee at its end
- "Use the force Harry" - Gandalf, Star Trek II


Re: #zeus meta-intel #zeus

Monsees, Steven C (US)
 

For this test case I was only building in opencl-clang and igc...

If I attempt to build in intel-compute-runtime, iy attempts to make use of igc and I see the following build issue:

08:11 smonsees@yix490031 /disk0/scratch/smonsees/yocto/workspace_1/builds2/sbcb-default>bitbake intel-compute-runtime
Loading cache: 100% |######################################################################################################| Time: 0:00:00
Loaded 3672 entries from dependency cache.
NOTE: Resolving any missing task queue dependencies

Build Configuration:
BB_VERSION = "1.44.0"
BUILD_SYS = "x86_64-linux"
NATIVELSBSTRING = "rhel-7.9"
TARGET_SYS = "x86_64-poky-linux"
MACHINE = "sbcb-default"
DISTRO = "limws"
DISTRO_VERSION = "3.0.4"
TUNE_FEATURES = "m64 corei7"
TARGET_FPU = ""
meta
meta-poky = "my_yocto_3.0.4:9662755c328d9406cccb206f6e67945f6894789b"
meta-perl
meta-python
meta-filesystems
meta-networking
meta-initramfs
meta-oe = "zeus:2b5dd1eb81cd08bc065bc76125f2856e9383e98b"
meta = "master:a32ddd2b2a51b26c011fa50e441df39304651503"
meta-clang = "zeus:f5355ca9b86fb5de5930132ffd95a9b352d694f9"
meta-intel = "zeus:d9942d4c3a710406b051852de7232db03c297f4e"
meta-intel = "LIMWSSWARE-423-oews-meta-bae-merge:fa33549eca95293aeec58bf0624b3315c08fdba0"

Initialising tasks: 100% |#################################################################################################| Time: 0:00:01
Checking sstate mirror object availability: 100% |#########################################################################| Time: 0:00:00
Sstate summary: Wanted 176 Found 166 Missed 10 Current 284 (94% match, 97% complete)
NOTE: Executing Tasks
NOTE: Setscene tasks completed
ERROR: intel-graphics-compiler-native-1.0.11-r0 do_compile: Execution of '/disk0/scratch/smonsees/yocto/workspace_1/builds2/sbcb-default/tmp/work/x86_64-linux/intel-graphics-compiler-native/1.0.11-r0/temp/run.do_compile.26870' failed with exit code 1:
[1/565] cd /disk0/scratch/smonsees/yocto/workspace_1/builds2/sbcb-default/tmp/work/x86_64-linux/intel-graphics-compiler-native/1.0.11-r0/git/visa && /disk0/scratch/smonsees/yocto/workspace_1/builds2/sbcb-default/tmp/work/x86_64-linux/intel-graphics-compiler-native/1.0.11-r0/recipe-sysroot-native/usr/bin/flex -PCISA -o/disk0/scratch/smonsees/yocto/workspace_1/builds2/sbcb-default/tmp/work/x86_64-linux/intel-graphics-compiler-native/1.0.11-r0/build/IGC/visa/lex.CISA.cpp CISA.l
CISA.l:486: warning, rule cannot be matched
[2/565] cd /disk0/scratch/smonsees/yocto/workspace_1/builds2/sbcb-default/tmp/work/x86_64-linux/intel-graphics-compiler-native/1.0.11-r0/build/IGC/BiFModule && /disk0/scratch/smonsees/yocto/workspace_1/builds2/sbcb-default/tmp/work/x86_64-linux/intel-graphics-compiler-native/1.0.11-r0/recipe-sysroot-native/usr/bin/cmake -E make_directory /disk0/scratch/smonsees/yocto/workspace_1/builds2/sbcb-default/tmp/work/x86_64-linux/intel-graphics-compiler-native/1.0.11-r0/build/IGC/Release/bif/. && /disk0/scratch/smonsees/yocto/workspace_1/builds2/sbcb-default/tmp/hosttools/python3 /disk0/scratch/smonsees/yocto/workspace_1/builds2/sbcb-default/tmp/work/x86_64-linux/intel-graphics-compiler-native/1.0.11-r0/git/IGC/BiFModule/concat.py -new /disk0/scratch/smonsees/yocto/workspace_1/builds2/sbcb-default/tmp/work/x86_64-linux/intel-graphics-compiler-native/1.0.11-r0/build/IGC/Release/bif/./opencl_cth.h /disk0/scratch/smonsees/yocto/workspace_1/builds2/sbcb-default/tmp/work/x86_64-linux/intel-graphics-compiler-native/1.0.11-r0/git/IGC/BiFModule/Languages/OpenCL/opencl_cth_released.h /disk0/scratch/smonsees/yocto/workspace_1/builds2/sbcb-default/tmp/work/x86_64-linux/intel-graphics-compiler-native/1.0.11-r0/git/IGC/BiFModule/Languages/OpenCL/PreRelease/opencl_cth_pre_release.h
[3/565] cd /disk0/scratch/smonsees/yocto/workspace_1/builds2/sbcb-default/tmp/work/x86_64-linux/intel-graphics-compiler-native/1.0.11-r0/build/IGC/autogen/MDAutogen && /disk0/scratch/smonsees/yocto/workspace_1/builds2/sbcb-default/tmp/hosttools/python3 /disk0/scratch/smonsees/yocto/workspace_1/builds2/sbcb-default/tmp/work/x86_64-linux/intel-graphics-compiler-native/1.0.11-r0/git/IGC/common/autogen.py /disk0/scratch/smonsees/yocto/workspace_1/builds2/sbcb-default/tmp/work/x86_64-linux/intel-graphics-compiler-native/1.0.11-r0/git/IGC/common/MDFrameWork.h /disk0/scratch/smonsees/yocto/workspace_1/builds2/sbcb-default/tmp/work/x86_64-linux/intel-graphics-compiler-native/1.0.11-r0/build/IGC/autogen/MDNodeFunctions.gen
[4/565] cd /disk0/scratch/smonsees/yocto/workspace_1/builds2/sbcb-default/tmp/work/x86_64-linux/intel-graphics-compiler-native/1.0.11-r0/build/IGC/GenISAIntrinsics && /disk0/scratch/smonsees/yocto/workspace_1/builds2/sbcb-default/tmp/hosttools/python3 /disk0/scratch/smonsees/yocto/workspace_1/builds2/sbcb-default/tmp/work/x86_64-linux/intel-graphics-compiler-native/1.0.11-r0/git/IGC/GenISAIntrinsics/Intrinsics.py Intrinsic_definitions.py /disk0/scratch/smonsees/yocto/workspace_1/builds2/sbcb-default/tmp/work/x86_64-linux/intel-graphics-compiler-native/1.0.11-r0/build/IGC/Release/IntrinsicGenISA.gen
[5/565] /disk0/scratch/smonsees/yocto/workspace_1/builds2/sbcb-default/tmp/hosttools/g++ -DCL_KHR_FP64_EXT -DGHAL3D=USC -DICBE_LINUX -DIGC_CMAKE -DIGC_EXPORTS=1 -DIGC_SPIRV_ENABLED -DINSIDE_PLUGIN -DISTDLIB_UMD -DLINUX -DNDEBUG -DNOMINMAX -DSTD_CALL -DUSC_EXPORTS=1 -DUSE_MMX -DUSE_SSE -DUSE_SSE2 -DUSE_SSE3 -DUSE_SSSE3 -D_AMD64_ -D_COMPILER_DLL_ -D_CRT_SECURE_NO_WARNINGS -D_HAS_EXCEPTIONS=0 -D_IGC_ -D_SCL_SECURE_NO_WARNINGS -D__STDC_CONSTANT_MACROS -D__STDC_LIMIT_MACROS -I/disk0/scratch/smonsees/yocto/workspace_1/builds2/sbcb-default/tmp/work/x86_64-linux/intel-graphics-compiler-native/1.0.11-r0/git/IGC/WrapperLLVM/include -IIGC/autogen -I/disk0/scratch/smonsees/yocto/workspace_1/builds2/sbcb-default/tmp/work/x86_64-linux/intel-graphics-compiler-native/1.0.11-r0/git/IGC -I/disk0/scratch/smonsees/yocto/workspace_1/builds2/sbcb-default/tmp/work/x86_64-linux/intel-graphics-compiler-native/1.0.11-r0/git/IGC/common -I/disk0/scratch/smonsees/yocto/workspace_1/builds2/sbcb-default/tmp/work/x86_64-linux/intel-graphics-compiler-native/1.0.11-r0/git/IGC/.. -I/disk0/scratch/smonsees/yocto/workspace_1/builds2/sbcb-default/tmp/work/x86_64-linux/intel-graphics-compiler-native/1.0.11-r0/git/IGC/../Common -I/disk0/scratch/smonsees/yocto/workspace_1/builds2/sbcb-default/tmp/work/x86_64-linux/intel-graphics-compiler-native/1.0.11-r0/git/IGC/../3d/common -I/disk0/scratch/smonsees/yocto/workspace_1/builds2/sbcb-default/tmp/work/x86_64-linux/intel-graphics-compiler-native/1.0.11-r0/git/IGC/../inc -I/disk0/scratch/smonsees/yocto/workspace_1/builds2/sbcb-default/tmp/work/x86_64-linux/intel-graphics-compiler-native/1.0.11-r0/git/IGC/../inc/common -I/disk0/scratch/smonsees/yocto/workspace_1/builds2/sbcb-default/tmp/work/x86_64-linux/intel-graphics-compiler-native/1.0.11-r0/git/IGC/../inc/common/Compiler -I/disk0/scratch/smonsees/yocto/workspace_1/builds2/sbcb-default/tmp/work/x86_64-linux/intel-graphics-compiler-native/1.0.11-r0/git/IGC/../inc/common/Compiler/API -I/disk0/scratch/smonsees/yocto/workspace_1/builds2/sbcb-default/tmp/work/x86_64-linux/intel-graphics-compiler-native/1.0.11-r0/git/IGC/../visa/include -IIGC/Release -I/disk0/scratch/smonsees/yocto/workspace_1/builds2/sbcb-default/tmp/work/x86_64-linux/intel-graphics-compiler-native/1.0.11-r0/git/IGC/AdaptorOCL/ocl_igc_shared/executable_format -I/disk0/scratch/smonsees/yocto/workspace_1/builds2/sbcb-default/tmp/work/x86_64-linux/intel-graphics-compiler-native/1.0.11-r0/git/IGC/AdaptorOCL -I/disk0/scratch/smonsees/yocto/workspace_1/builds2/sbcb-default/tmp/work/x86_64-linux/intel-graphics-compiler-native/1.0.11-r0/git/IGC/../inc/common/Compiler/common -I/disk0/scratch/smonsees/yocto/workspace_1/builds2/sbcb-default/tmp/work/x86_64-linux/intel-graphics-compiler-native/1.0.11-r0/git/IGC/AdaptorOCL/cif/cif/.. -I/disk0/scratch/smonsees/yocto/workspace_1/builds2/sbcb-default/tmp/work/x86_64-linux/intel-graphics-compiler-native/1.0.11-r0/git/IGC/GenISAIntrinsics -isystem/disk0/scratch/smonsees/yocto/workspace_1/builds2/sbcb-default/tmp/work/x86_64-linux/intel-graphics-compiler-native/1.0.11-r0/recipe-sysroot-native/usr/include -pipe -fno-exceptions -fdata-sections -ffunction-sections -O2 -fmessage-length=0 -march=corei7 -mstackrealign -fms-extensions -Werror -Wno-unused-parameter -Wno-missing-field-initializers -Wwrite-strings -Wno-long-long -Wswitch -Wno-sign-compare -Wno-unused-result -Wno-enum-compare -Wno-type-limits -Wno-ignored-qualifiers -Wformat -Wformat-security -Wno-extra -Wno-write-strings -finline -fno-strict-aliasing -msse -msse2 -msse3 -mssse3 -msse4 -msse4.1 -msse4.2 -Wno-unknown-pragmas -fPIC -D_FORTIFY_SOURCE=2 -fstack-protector -finline-functions -funswitch-loops -Wno-maybe-uninitialized -lrt -fno-rtti -fvisibility=hidden -fvisibility-inlines-hidden -std=c++14 -DNDEBUG -g -std=gnu++1y -MD -MT IGC/GenISAIntrinsics/CMakeFiles/GenISAIntrinsics.dir/GenIntrinsics.cpp.o -MF IGC/GenISAIntrinsics/CMakeFiles/GenISAIntrinsics.dir/GenIntrinsics.cpp.o.d -o IGC/GenISAIntrinsics/CMakeFiles/GenISAIntrinsics.dir/GenIntrinsics.cpp.o -c /disk0/scratch/smonsees/yocto/workspace_1/builds2/sbcb-default/tmp/work/x86_64-linux/intel-graphics-compiler-native/1.0.11-r0/git/IGC/GenISAIntrinsics/GenIntrinsics.cpp
FAILED: IGC/GenISAIntrinsics/CMakeFiles/GenISAIntrinsics.dir/GenIntrinsics.cpp.o
/disk0/scratch/smonsees/yocto/workspace_1/builds2/sbcb-default/tmp/hosttools/g++ -DCL_KHR_FP64_EXT -DGHAL3D=USC -DICBE_LINUX -DIGC_CMAKE -DIGC_EXPORTS=1 -DIGC_SPIRV_ENABLED -DINSIDE_PLUGIN -DISTDLIB_UMD -DLINUX -DNDEBUG -DNOMINMAX -DSTD_CALL -DUSC_EXPORTS=1 -DUSE_MMX -DUSE_SSE -DUSE_SSE2 -DUSE_SSE3 -DUSE_SSSE3 -D_AMD64_ -D_COMPILER_DLL_ -D_CRT_SECURE_NO_WARNINGS -D_HAS_EXCEPTIONS=0 -D_IGC_ -D_SCL_SECURE_NO_WARNINGS -D__STDC_CONSTANT_MACROS -D__STDC_LIMIT_MACROS -I/disk0/scratch/smonsees/yocto/workspace_1/builds2/sbcb-default/tmp/work/x86_64-linux/intel-graphics-compiler-native/1.0.11-r0/git/IGC/WrapperLLVM/include -IIGC/autogen -I/disk0/scratch/smonsees/yocto/workspace_1/builds2/sbcb-default/tmp/work/x86_64-linux/intel-graphics-compiler-native/1.0.11-r0/git/IGC -I/disk0/scratch/smonsees/yocto/workspace_1/builds2/sbcb-default/tmp/work/x86_64-linux/intel-graphics-compiler-native/1.0.11-r0/git/IGC/common -I/disk0/scratch/smonsees/yocto/workspace_1/builds2/sbcb-default/tmp/work/x86_64-linux/intel-graphics-compiler-native/1.0.11-r0/git/IGC/.. -I/disk0/scratch/smonsees/yocto/workspace_1/builds2/sbcb-default/tmp/work/x86_64-linux/intel-graphics-compiler-native/1.0.11-r0/git/IGC/../Common -I/disk0/scratch/smonsees/yocto/workspace_1/builds2/sbcb-default/tmp/work/x86_64-linux/intel-graphics-compiler-native/1.0.11-r0/git/IGC/../3d/common -I/disk0/scratch/smonsees/yocto/workspace_1/builds2/sbcb-default/tmp/work/x86_64-linux/intel-graphics-compiler-native/1.0.11-r0/git/IGC/../inc -I/disk0/scratch/smonsees/yocto/workspace_1/builds2/sbcb-default/tmp/work/x86_64-linux/intel-graphics-compiler-native/1.0.11-r0/git/IGC/../inc/common -I/disk0/scratch/smonsees/yocto/workspace_1/builds2/sbcb-default/tmp/work/x86_64-linux/intel-graphics-compiler-native/1.0.11-r0/git/IGC/../inc/common/Compiler -I/disk0/scratch/smonsees/yocto/workspace_1/builds2/sbcb-default/tmp/work/x86_64-linux/intel-graphics-compiler-native/1.0.11-r0/git/IGC/../inc/common/Compiler/API -I/disk0/scratch/smonsees/yocto/workspace_1/builds2/sbcb-default/tmp/work/x86_64-linux/intel-graphics-compiler-native/1.0.11-r0/git/IGC/../visa/include -IIGC/Release -I/disk0/scratch/smonsees/yocto/workspace_1/builds2/sbcb-default/tmp/work/x86_64-linux/intel-graphics-compiler-native/1.0.11-r0/git/IGC/AdaptorOCL/ocl_igc_shared/executable_format -I/disk0/scratch/smonsees/yocto/workspace_1/builds2/sbcb-default/tmp/work/x86_64-linux/intel-graphics-compiler-native/1.0.11-r0/git/IGC/AdaptorOCL -I/disk0/scratch/smonsees/yocto/workspace_1/builds2/sbcb-default/tmp/work/x86_64-linux/intel-graphics-compiler-native/1.0.11-r0/git/IGC/../inc/common/Compiler/common -I/disk0/scratch/smonsees/yocto/workspace_1/builds2/sbcb-default/tmp/work/x86_64-linux/intel-graphics-compiler-native/1.0.11-r0/git/IGC/AdaptorOCL/cif/cif/.. -I/disk0/scratch/smonsees/yocto/workspace_1/builds2/sbcb-default/tmp/work/x86_64-linux/intel-graphics-compiler-native/1.0.11-r0/git/IGC/GenISAIntrinsics -isystem/disk0/scratch/smonsees/yocto/workspace_1/builds2/sbcb-default/tmp/work/x86_64-linux/intel-graphics-compiler-native/1.0.11-r0/recipe-sysroot-native/usr/include -pipe -fno-exceptions -fdata-sections -ffunction-sections -O2 -fmessage-length=0 -march=corei7 -mstackrealign -fms-extensions -Werror -Wno-unused-parameter -Wno-missing-field-initializers -Wwrite-strings -Wno-long-long -Wswitch -Wno-sign-compare -Wno-unused-result -Wno-enum-compare -Wno-type-limits -Wno-ignored-qualifiers -Wformat -Wformat-security -Wno-extra -Wno-write-strings -finline -fno-strict-aliasing -msse -msse2 -msse3 -mssse3 -msse4 -msse4.1 -msse4.2 -Wno-unknown-pragmas -fPIC -D_FORTIFY_SOURCE=2 -fstack-protector -finline-functions -funswitch-loops -Wno-maybe-uninitialized -lrt -fno-rtti -fvisibility=hidden -fvisibility-inlines-hidden -std=c++14 -DNDEBUG -g -std=gnu++1y -MD -MT IGC/GenISAIntrinsics/CMakeFiles/GenISAIntrinsics.dir/GenIntrinsics.cpp.o -MF IGC/GenISAIntrinsics/CMakeFiles/GenISAIntrinsics.dir/GenIntrinsics.cpp.o.d -o IGC/GenISAIntrinsics/CMakeFiles/GenISAIntrinsics.dir/GenIntrinsics.cpp.o -c /disk0/scratch/smonsees/yocto/workspace_1/builds2/sbcb-default/tmp/work/x86_64-linux/intel-graphics-compiler-native/1.0.11-r0/git/IGC/GenISAIntrinsics/GenIntrinsics.cpp
g++: error: unrecognized command line option ‘-std=c++14’
[6/565] cd /disk0/scratch/smonsees/yocto/workspace_1/builds2/sbcb-default/tmp/work/x86_64-linux/intel-graphics-compiler-native/1.0.11-r0/git/visa && /disk0/scratch/smonsees/yocto/workspace_1/builds2/sbcb-default/tmp/work/x86_64-linux/intel-graphics-compiler-native/1.0.11-r0/recipe-sysroot-native/usr/bin/bison -vt -p CISA -d -o /disk0/scratch/smonsees/yocto/workspace_1/builds2/sbcb-default/tmp/work/x86_64-linux/intel-graphics-compiler-native/1.0.11-r0/build/IGC/visa/CISA.tab.cpp CISA.y
CISA.y:84.1-14: warning: deprecated directive, use ‘%define parse.error verbose’ [-Wdeprecated]
84 | %error-verbose
| ^~~~~~~~~~~~~~
CISA.y: warning: 1 nonterminal useless in grammar [-Wother]
CISA.y: warning: 1 rule useless in grammar [-Wother]
CISA.y:1478.1-16: warning: nonterminal useless in grammar: VecSrcOpndSimple [-Wother]
1478 | VecSrcOpndSimple : VAR TwoDimOffset
| ^~~~~~~~~~~~~~~~
CISA.y: warning: 140 shift/reduce conflicts [-Wconflicts-sr]
CISA.y: warning: 20 reduce/reduce conflicts [-Wconflicts-rr]
CISA.y: warning: fix-its can be applied. Rerun with option '--update'. [-Wother]
[7/565] cd /disk0/scratch/smonsees/yocto/workspace_1/builds2/sbcb-default/tmp/work/x86_64-linux/intel-graphics-compiler-native/1.0.11-r0/build/IGC/BiFModule && /disk0/scratch/smonsees/yocto/workspace_1/builds2/sbcb-default/tmp/work/x86_64-linux/intel-graphics-compiler-native/1.0.11-r0/recipe-sysroot-native/usr/bin/cmake -E make_directory /disk0/scratch/smonsees/yocto/workspace_1/builds2/sbcb-default/tmp/work/x86_64-linux/intel-graphics-compiler-native/1.0.11-r0/build/IGC/Release/bif/. && /disk0/scratch/smonsees/yocto/workspace_1/builds2/sbcb-default/tmp/work/x86_64-linux/intel-graphics-compiler-native/1.0.11-r0/recipe-sysroot-native/usr/bin/clang-9 -cc1 -x cl -fblocks -fpreserve-vec3-type -opencl-builtins -triple=spir64 -w -emit-llvm-bc -o /disk0/scratch/smonsees/yocto/workspace_1/builds2/sbcb-default/tmp/work/x86_64-linux/intel-graphics-compiler-native/1.0.11-r0/build/IGC/Release/bif/./IBiF_spirv_size_t_64.bc_pointersize__cl__0.bc.tmp -include /disk0/scratch/smonsees/yocto/workspace_1/builds2/sbcb-default/tmp/work/x86_64-linux/intel-graphics-compiler-native/1.0.11-r0/build/IGC/Release/bif/./opencl_cth.h -I /disk0/scratch/smonsees/yocto/workspace_1/builds2/sbcb-default/tmp/work/x86_64-linux/intel-graphics-compiler-native/1.0.11-r0/git/IGC/BiFModule/Languages/OpenCL -I /disk0/scratch/smonsees/yocto/workspace_1/builds2/sbcb-default/tmp/work/x86_64-linux/intel-graphics-compiler-native/1.0.11-r0/git/IGC/BiFModule/Languages/OpenCL/PointerSize -I /disk0/scratch/smonsees/yocto/workspace_1/builds2/sbcb-default/tmp/work/x86_64-linux/intel-graphics-compiler-native/1.0.11-r0/git/IGC/BiFModule/Headers -I /disk0/scratch/smonsees/yocto/workspace_1/builds2/sbcb-default/tmp/work/x86_64-linux/intel-graphics-compiler-native/1.0.11-r0/git/IGC/BiFModule/../AdaptorOCL/ocl_igc_shared/device_enqueue -D__EXECUTION_MODEL_DEBUG=1 -D__OPENCL_C_VERSION__=200 -D__IGC_BUILD__ -Dcl_khr_f16 -Dcl_khrfp64 -Dcl_khr_gl_msaa_sharing -Dcl_khr_mipmap_image -Dcl_khr_depth_images -Dcl_intel_subgroups_short -Dcl_intel_subgroups_char -Dcl_intel_subgroups_long -Dcl_intel_64bit_global_atomics_placeholder -D__VME_TYPES_DEFINED__ -finclude-default-header -cl-std=CL2.0 /disk0/scratch/smonsees/yocto/workspace_1/builds2/sbcb-default/tmp/work/x86_64-linux/intel-graphics-compiler-native/1.0.11-r0/git/IGC/BiFModule/Implementation/pointersize.cl
[8/565] cd /disk0/scratch/smonsees/yocto/workspace_1/builds2/sbcb-default/tmp/work/x86_64-linux/intel-graphics-compiler-native/1.0.11-r0/build/IGC/BiFModule && /disk0/scratch/smonsees/yocto/workspace_1/builds2/sbcb-default/tmp/work/x86_64-linux/intel-graphics-compiler-native/1.0.11-r0/recipe-sysroot-native/usr/bin/cmake -E make_directory /disk0/scratch/smonsees/yocto/workspace_1/builds2/sbcb-default/tmp/work/x86_64-linux/intel-graphics-compiler-native/1.0.11-r0/build/IGC/Release/bif/. && /disk0/scratch/smonsees/yocto/workspace_1/builds2/sbcb-default/tmp/work/x86_64-linux/intel-graphics-compiler-native/1.0.11-r0/recipe-sysroot-native/usr/bin/clang-9 -cc1 -x cl -fblocks -fpreserve-vec3-type -opencl-builtins -triple=spir64 -w -emit-llvm-bc -o /disk0/scratch/smonsees/yocto/workspace_1/builds2/sbcb-default/tmp/work/x86_64-linux/intel-graphics-compiler-native/1.0.11-r0/build/IGC/Release/bif/./IBiF_Impl_int_spirv.bc_IBiF_Impl__cl__0.bc.tmp -include /disk0/scratch/smonsees/yocto/workspace_1/builds2/sbcb-default/tmp/work/x86_64-linux/intel-graphics-compiler-native/1.0.11-r0/build/IGC/Release/bif/./opencl_cth.h -I /disk0/scratch/smonsees/yocto/workspace_1/builds2/sbcb-default/tmp/work/x86_64-linux/intel-graphics-compiler-native/1.0.11-r0/git/IGC/BiFModule/Implementation -I /disk0/scratch/smonsees/yocto/workspace_1/builds2/sbcb-default/tmp/work/x86_64-linux/intel-graphics-compiler-native/1.0.11-r0/git/IGC/BiFModule/Headers -I /disk0/scratch/smonsees/yocto/workspace_1/builds2/sbcb-default/tmp/work/x86_64-linux/intel-graphics-compiler-native/1.0.11-r0/git/IGC/BiFModule/../AdaptorOCL/ocl_igc_interface/device_enqueue -D__EXECUTION_MODEL_DEBUG=1 -D__OPENCL_C_VERSION__=200 -D__IGC_BUILD__ -Dcl_khr_f16 -Dcl_khrfp64 -Dcl_khr_gl_msaa_sharing -Dcl_khr_mipmap_image -Dcl_khr_depth_images -Dcl_intel_subgroups_short -Dcl_intel_subgroups_char -Dcl_intel_subgroups_long -Dcl_intel_64bit_global_atomics_placeholder -D__VME_TYPES_DEFINED__ -finclude-default-header -cl-std=CL2.0 /disk0/scratch/smonsees/yocto/workspace_1/builds2/sbcb-default/tmp/work/x86_64-linux/intel-graphics-compiler-native/1.0.11-r0/git/IGC/BiFModule/Implementation/IBiF_Impl.cl
ninja: build stopped: subcommand failed.
WARNING: /disk0/scratch/smonsees/yocto/workspace_1/builds2/sbcb-default/tmp/work/x86_64-linux/intel-graphics-compiler-native/1.0.11-r0/temp/run.do_compile.26870:1 exit 1 from 'VERBOSE=1 cmake --build /disk0/scratch/smonsees/yocto/workspace_1/builds2/sbcb-default/tmp/work/x86_64-linux/intel-graphics-compiler-native/1.0.11-r0/build --target all -- -j 4'

ERROR: Logfile of failure stored in: /disk0/scratch/smonsees/yocto/workspace_1/builds2/sbcb-default/tmp/work/x86_64-linux/intel-graphics-compiler-native/1.0.11-r0/temp/log.do_compile.26870
Log data follows:
| DEBUG: Executing shell function do_compile
| NOTE: VERBOSE=1 cmake --build /disk0/scratch/smonsees/yocto/workspace_1/builds2/sbcb-default/tmp/work/x86_64-linux/intel-graphics-compiler-native/1.0.11-r0/build --target all -- -j 4
| [1/565] cd /disk0/scratch/smonsees/yocto/workspace_1/builds2/sbcb-default/tmp/work/x86_64-linux/intel-graphics-compiler-native/1.0.11-r0/git/visa && /disk0/scratch/smonsees/yocto/workspace_1/builds2/sbcb-default/tmp/work/x86_64-linux/intel-graphics-compiler-native/1.0.11-r0/recipe-sysroot-native/usr/bin/flex -PCISA -o/disk0/scratch/smonsees/yocto/workspace_1/builds2/sbcb-default/tmp/work/x86_64-linux/intel-graphics-compiler-native/1.0.11-r0/build/IGC/visa/lex.CISA.cpp CISA.l
| CISA.l:486: warning, rule cannot be matched
| [2/565] cd /disk0/scratch/smonsees/yocto/workspace_1/builds2/sbcb-default/tmp/work/x86_64-linux/intel-graphics-compiler-native/1.0.11-r0/build/IGC/BiFModule && /disk0/scratch/smonsees/yocto/workspace_1/builds2/sbcb-default/tmp/work/x86_64-linux/intel-graphics-compiler-native/1.0.11-r0/recipe-sysroot-native/usr/bin/cmake -E make_directory /disk0/scratch/smonsees/yocto/workspace_1/builds2/sbcb-default/tmp/work/x86_64-linux/intel-graphics-compiler-native/1.0.11-r0/build/IGC/Release/bif/. && /disk0/scratch/smonsees/yocto/workspace_1/builds2/sbcb-default/tmp/hosttools/python3 /disk0/scratch/smonsees/yocto/workspace_1/builds2/sbcb-default/tmp/work/x86_64-linux/intel-graphics-compiler-native/1.0.11-r0/git/IGC/BiFModule/concat.py -new /disk0/scratch/smonsees/yocto/workspace_1/builds2/sbcb-default/tmp/work/x86_64-linux/intel-graphics-compiler-native/1.0.11-r0/build/IGC/Release/bif/./opencl_cth.h /disk0/scratch/smonsees/yocto/workspace_1/builds2/sbcb-default/tmp/work/x86_64-linux/intel-graphics-compiler-native/1.0.11-r0/git/IGC/BiFModule/Languages/OpenCL/opencl_cth_released.h /disk0/scratch/smonsees/yocto/workspace_1/builds2/sbcb-default/tmp/work/x86_64-linux/intel-graphics-compiler-native/1.0.11-r0/git/IGC/BiFModule/Languages/OpenCL/PreRelease/opencl_cth_pre_release.h
| [3/565] cd /disk0/scratch/smonsees/yocto/workspace_1/builds2/sbcb-default/tmp/work/x86_64-linux/intel-graphics-compiler-native/1.0.11-r0/build/IGC/autogen/MDAutogen && /disk0/scratch/smonsees/yocto/workspace_1/builds2/sbcb-default/tmp/hosttools/python3 /disk0/scratch/smonsees/yocto/workspace_1/builds2/sbcb-default/tmp/work/x86_64-linux/intel-graphics-compiler-native/1.0.11-r0/git/IGC/common/autogen.py /disk0/scratch/smonsees/yocto/workspace_1/builds2/sbcb-default/tmp/work/x86_64-linux/intel-graphics-compiler-native/1.0.11-r0/git/IGC/common/MDFrameWork.h /disk0/scratch/smonsees/yocto/workspace_1/builds2/sbcb-default/tmp/work/x86_64-linux/intel-graphics-compiler-native/1.0.11-r0/build/IGC/autogen/MDNodeFunctions.gen
| [4/565] cd /disk0/scratch/smonsees/yocto/workspace_1/builds2/sbcb-default/tmp/work/x86_64-linux/intel-graphics-compiler-native/1.0.11-r0/build/IGC/GenISAIntrinsics && /disk0/scratch/smonsees/yocto/workspace_1/builds2/sbcb-default/tmp/hosttools/python3 /disk0/scratch/smonsees/yocto/workspace_1/builds2/sbcb-default/tmp/work/x86_64-linux/intel-graphics-compiler-native/1.0.11-r0/git/IGC/GenISAIntrinsics/Intrinsics.py Intrinsic_definitions.py /disk0/scratch/smonsees/yocto/workspace_1/builds2/sbcb-default/tmp/work/x86_64-linux/intel-graphics-compiler-native/1.0.11-r0/build/IGC/Release/IntrinsicGenISA.gen
| [5/565] /disk0/scratch/smonsees/yocto/workspace_1/builds2/sbcb-default/tmp/hosttools/g++ -DCL_KHR_FP64_EXT -DGHAL3D=USC -DICBE_LINUX -DIGC_CMAKE -DIGC_EXPORTS=1 -DIGC_SPIRV_ENABLED -DINSIDE_PLUGIN -DISTDLIB_UMD -DLINUX -DNDEBUG -DNOMINMAX -DSTD_CALL -DUSC_EXPORTS=1 -DUSE_MMX -DUSE_SSE -DUSE_SSE2 -DUSE_SSE3 -DUSE_SSSE3 -D_AMD64_ -D_COMPILER_DLL_ -D_CRT_SECURE_NO_WARNINGS -D_HAS_EXCEPTIONS=0 -D_IGC_ -D_SCL_SECURE_NO_WARNINGS -D__STDC_CONSTANT_MACROS -D__STDC_LIMIT_MACROS -I/disk0/scratch/smonsees/yocto/workspace_1/builds2/sbcb-default/tmp/work/x86_64-linux/intel-graphics-compiler-native/1.0.11-r0/git/IGC/WrapperLLVM/include -IIGC/autogen -I/disk0/scratch/smonsees/yocto/workspace_1/builds2/sbcb-default/tmp/work/x86_64-linux/intel-graphics-compiler-native/1.0.11-r0/git/IGC -I/disk0/scratch/smonsees/yocto/workspace_1/builds2/sbcb-default/tmp/work/x86_64-linux/intel-graphics-compiler-native/1.0.11-r0/git/IGC/common -I/disk0/scratch/smonsees/yocto/workspace_1/builds2/sbcb-default/tmp/work/x86_64-linux/intel-graphics-compiler-native/1.0.11-r0/git/IGC/.. -I/disk0/scratch/smonsees/yocto/workspace_1/builds2/sbcb-default/tmp/work/x86_64-linux/intel-graphics-compiler-native/1.0.11-r0/git/IGC/../Common -I/disk0/scratch/smonsees/yocto/workspace_1/builds2/sbcb-default/tmp/work/x86_64-linux/intel-graphics-compiler-native/1.0.11-r0/git/IGC/../3d/common -I/disk0/scratch/smonsees/yocto/workspace_1/builds2/sbcb-default/tmp/work/x86_64-linux/intel-graphics-compiler-native/1.0.11-r0/git/IGC/../inc -I/disk0/scratch/smonsees/yocto/workspace_1/builds2/sbcb-default/tmp/work/x86_64-linux/intel-graphics-compiler-native/1.0.11-r0/git/IGC/../inc/common -I/disk0/scratch/smonsees/yocto/workspace_1/builds2/sbcb-default/tmp/work/x86_64-linux/intel-graphics-compiler-native/1.0.11-r0/git/IGC/../inc/common/Compiler -I/disk0/scratch/smonsees/yocto/workspace_1/builds2/sbcb-default/tmp/work/x86_64-linux/intel-graphics-compiler-native/1.0.11-r0/git/IGC/../inc/common/Compiler/API -I/disk0/scratch/smonsees/yocto/workspace_1/builds2/sbcb-default/tmp/work/x86_64-linux/intel-graphics-compiler-native/1.0.11-r0/git/IGC/../visa/include -IIGC/Release -I/disk0/scratch/smonsees/yocto/workspace_1/builds2/sbcb-default/tmp/work/x86_64-linux/intel-graphics-compiler-native/1.0.11-r0/git/IGC/AdaptorOCL/ocl_igc_shared/executable_format -I/disk0/scratch/smonsees/yocto/workspace_1/builds2/sbcb-default/tmp/work/x86_64-linux/intel-graphics-compiler-native/1.0.11-r0/git/IGC/AdaptorOCL -I/disk0/scratch/smonsees/yocto/workspace_1/builds2/sbcb-default/tmp/work/x86_64-linux/intel-graphics-compiler-native/1.0.11-r0/git/IGC/../inc/common/Compiler/common -I/disk0/scratch/smonsees/yocto/workspace_1/builds2/sbcb-default/tmp/work/x86_64-linux/intel-graphics-compiler-native/1.0.11-r0/git/IGC/AdaptorOCL/cif/cif/.. -I/disk0/scratch/smonsees/yocto/workspace_1/builds2/sbcb-default/tmp/work/x86_64-linux/intel-graphics-compiler-native/1.0.11-r0/git/IGC/GenISAIntrinsics -isystem/disk0/scratch/smonsees/yocto/workspace_1/builds2/sbcb-default/tmp/work/x86_64-linux/intel-graphics-compiler-native/1.0.11-r0/recipe-sysroot-native/usr/include -pipe -fno-exceptions -fdata-sections -ffunction-sections -O2 -fmessage-length=0 -march=corei7 -mstackrealign -fms-extensions -Werror -Wno-unused-parameter -Wno-missing-field-initializers -Wwrite-strings -Wno-long-long -Wswitch -Wno-sign-compare -Wno-unused-result -Wno-enum-compare -Wno-type-limits -Wno-ignored-qualifiers -Wformat -Wformat-security -Wno-extra -Wno-write-strings -finline -fno-strict-aliasing -msse -msse2 -msse3 -mssse3 -msse4 -msse4.1 -msse4.2 -Wno-unknown-pragmas -fPIC -D_FORTIFY_SOURCE=2 -fstack-protector -finline-functions -funswitch-loops -Wno-maybe-uninitialized -lrt -fno-rtti -fvisibility=hidden -fvisibility-inlines-hidden -std=c++14 -DNDEBUG -g -std=gnu++1y -MD -MT IGC/GenISAIntrinsics/CMakeFiles/GenISAIntrinsics.dir/GenIntrinsics.cpp.o -MF IGC/GenISAIntrinsics/CMakeFiles/GenISAIntrinsics.dir/GenIntrinsics.cpp.o.d -o IGC/GenISAIntrinsics/CMakeFiles/GenISAIntrinsics.dir/GenIntrinsics.cpp.o -c /disk0/scratch/smonsees/yocto/workspace_1/builds2/sbcb-default/tmp/work/x86_64-linux/intel-graphics-compiler-native/1.0.11-r0/git/IGC/GenISAIntrinsics/GenIntrinsics.cpp
| FAILED: IGC/GenISAIntrinsics/CMakeFiles/GenISAIntrinsics.dir/GenIntrinsics.cpp.o
| /disk0/scratch/smonsees/yocto/workspace_1/builds2/sbcb-default/tmp/hosttools/g++ -DCL_KHR_FP64_EXT -DGHAL3D=USC -DICBE_LINUX -DIGC_CMAKE -DIGC_EXPORTS=1 -DIGC_SPIRV_ENABLED -DINSIDE_PLUGIN -DISTDLIB_UMD -DLINUX -DNDEBUG -DNOMINMAX -DSTD_CALL -DUSC_EXPORTS=1 -DUSE_MMX -DUSE_SSE -DUSE_SSE2 -DUSE_SSE3 -DUSE_SSSE3 -D_AMD64_ -D_COMPILER_DLL_ -D_CRT_SECURE_NO_WARNINGS -D_HAS_EXCEPTIONS=0 -D_IGC_ -D_SCL_SECURE_NO_WARNINGS -D__STDC_CONSTANT_MACROS -D__STDC_LIMIT_MACROS -I/disk0/scratch/smonsees/yocto/workspace_1/builds2/sbcb-default/tmp/work/x86_64-linux/intel-graphics-compiler-native/1.0.11-r0/git/IGC/WrapperLLVM/include -IIGC/autogen -I/disk0/scratch/smonsees/yocto/workspace_1/builds2/sbcb-default/tmp/work/x86_64-linux/intel-graphics-compiler-native/1.0.11-r0/git/IGC -I/disk0/scratch/smonsees/yocto/workspace_1/builds2/sbcb-default/tmp/work/x86_64-linux/intel-graphics-compiler-native/1.0.11-r0/git/IGC/common -I/disk0/scratch/smonsees/yocto/workspace_1/builds2/sbcb-default/tmp/work/x86_64-linux/intel-graphics-compiler-native/1.0.11-r0/git/IGC/.. -I/disk0/scratch/smonsees/yocto/workspace_1/builds2/sbcb-default/tmp/work/x86_64-linux/intel-graphics-compiler-native/1.0.11-r0/git/IGC/../Common -I/disk0/scratch/smonsees/yocto/workspace_1/builds2/sbcb-default/tmp/work/x86_64-linux/intel-graphics-compiler-native/1.0.11-r0/git/IGC/../3d/common -I/disk0/scratch/smonsees/yocto/workspace_1/builds2/sbcb-default/tmp/work/x86_64-linux/intel-graphics-compiler-native/1.0.11-r0/git/IGC/../inc -I/disk0/scratch/smonsees/yocto/workspace_1/builds2/sbcb-default/tmp/work/x86_64-linux/intel-graphics-compiler-native/1.0.11-r0/git/IGC/../inc/common -I/disk0/scratch/smonsees/yocto/workspace_1/builds2/sbcb-default/tmp/work/x86_64-linux/intel-graphics-compiler-native/1.0.11-r0/git/IGC/../inc/common/Compiler -I/disk0/scratch/smonsees/yocto/workspace_1/builds2/sbcb-default/tmp/work/x86_64-linux/intel-graphics-compiler-native/1.0.11-r0/git/IGC/../inc/common/Compiler/API -I/disk0/scratch/smonsees/yocto/workspace_1/builds2/sbcb-default/tmp/work/x86_64-linux/intel-graphics-compiler-native/1.0.11-r0/git/IGC/../visa/include -IIGC/Release -I/disk0/scratch/smonsees/yocto/workspace_1/builds2/sbcb-default/tmp/work/x86_64-linux/intel-graphics-compiler-native/1.0.11-r0/git/IGC/AdaptorOCL/ocl_igc_shared/executable_format -I/disk0/scratch/smonsees/yocto/workspace_1/builds2/sbcb-default/tmp/work/x86_64-linux/intel-graphics-compiler-native/1.0.11-r0/git/IGC/AdaptorOCL -I/disk0/scratch/smonsees/yocto/workspace_1/builds2/sbcb-default/tmp/work/x86_64-linux/intel-graphics-compiler-native/1.0.11-r0/git/IGC/../inc/common/Compiler/common -I/disk0/scratch/smonsees/yocto/workspace_1/builds2/sbcb-default/tmp/work/x86_64-linux/intel-graphics-compiler-native/1.0.11-r0/git/IGC/AdaptorOCL/cif/cif/.. -I/disk0/scratch/smonsees/yocto/workspace_1/builds2/sbcb-default/tmp/work/x86_64-linux/intel-graphics-compiler-native/1.0.11-r0/git/IGC/GenISAIntrinsics -isystem/disk0/scratch/smonsees/yocto/workspace_1/builds2/sbcb-default/tmp/work/x86_64-linux/intel-graphics-compiler-native/1.0.11-r0/recipe-sysroot-native/usr/include -pipe -fno-exceptions -fdata-sections -ffunction-sections -O2 -fmessage-length=0 -march=corei7 -mstackrealign -fms-extensions -Werror -Wno-unused-parameter -Wno-missing-field-initializers -Wwrite-strings -Wno-long-long -Wswitch -Wno-sign-compare -Wno-unused-result -Wno-enum-compare -Wno-type-limits -Wno-ignored-qualifiers -Wformat -Wformat-security -Wno-extra -Wno-write-strings -finline -fno-strict-aliasing -msse -msse2 -msse3 -mssse3 -msse4 -msse4.1 -msse4.2 -Wno-unknown-pragmas -fPIC -D_FORTIFY_SOURCE=2 -fstack-protector -finline-functions -funswitch-loops -Wno-maybe-uninitialized -lrt -fno-rtti -fvisibility=hidden -fvisibility-inlines-hidden -std=c++14 -DNDEBUG -g -std=gnu++1y -MD -MT IGC/GenISAIntrinsics/CMakeFiles/GenISAIntrinsics.dir/GenIntrinsics.cpp.o -MF IGC/GenISAIntrinsics/CMakeFiles/GenISAIntrinsics.dir/GenIntrinsics.cpp.o.d -o IGC/GenISAIntrinsics/CMakeFiles/GenISAIntrinsics.dir/GenIntrinsics.cpp.o -c /disk0/scratch/smonsees/yocto/workspace_1/builds2/sbcb-default/tmp/work/x86_64-linux/intel-graphics-compiler-native/1.0.11-r0/git/IGC/GenISAIntrinsics/GenIntrinsics.cpp
| g++: error: unrecognized command line option ‘-std=c++14’
| [6/565] cd /disk0/scratch/smonsees/yocto/workspace_1/builds2/sbcb-default/tmp/work/x86_64-linux/intel-graphics-compiler-native/1.0.11-r0/git/visa && /disk0/scratch/smonsees/yocto/workspace_1/builds2/sbcb-default/tmp/work/x86_64-linux/intel-graphics-compiler-native/1.0.11-r0/recipe-sysroot-native/usr/bin/bison -vt -p CISA -d -o /disk0/scratch/smonsees/yocto/workspace_1/builds2/sbcb-default/tmp/work/x86_64-linux/intel-graphics-compiler-native/1.0.11-r0/build/IGC/visa/CISA.tab.cpp CISA.y
| CISA.y:84.1-14: warning: deprecated directive, use ‘%define parse.error verbose’ [-Wdeprecated]
| 84 | %error-verbose
| | ^~~~~~~~~~~~~~
| CISA.y: warning: 1 nonterminal useless in grammar [-Wother]
| CISA.y: warning: 1 rule useless in grammar [-Wother]
| CISA.y:1478.1-16: warning: nonterminal useless in grammar: VecSrcOpndSimple [-Wother]
| 1478 | VecSrcOpndSimple : VAR TwoDimOffset
| | ^~~~~~~~~~~~~~~~
| CISA.y: warning: 140 shift/reduce conflicts [-Wconflicts-sr]
| CISA.y: warning: 20 reduce/reduce conflicts [-Wconflicts-rr]
| CISA.y: warning: fix-its can be applied. Rerun with option '--update'. [-Wother]
| [7/565] cd /disk0/scratch/smonsees/yocto/workspace_1/builds2/sbcb-default/tmp/work/x86_64-linux/intel-graphics-compiler-native/1.0.11-r0/build/IGC/BiFModule && /disk0/scratch/smonsees/yocto/workspace_1/builds2/sbcb-default/tmp/work/x86_64-linux/intel-graphics-compiler-native/1.0.11-r0/recipe-sysroot-native/usr/bin/cmake -E make_directory /disk0/scratch/smonsees/yocto/workspace_1/builds2/sbcb-default/tmp/work/x86_64-linux/intel-graphics-compiler-native/1.0.11-r0/build/IGC/Release/bif/. && /disk0/scratch/smonsees/yocto/workspace_1/builds2/sbcb-default/tmp/work/x86_64-linux/intel-graphics-compiler-native/1.0.11-r0/recipe-sysroot-native/usr/bin/clang-9 -cc1 -x cl -fblocks -fpreserve-vec3-type -opencl-builtins -triple=spir64 -w -emit-llvm-bc -o /disk0/scratch/smonsees/yocto/workspace_1/builds2/sbcb-default/tmp/work/x86_64-linux/intel-graphics-compiler-native/1.0.11-r0/build/IGC/Release/bif/./IBiF_spirv_size_t_64.bc_pointersize__cl__0.bc.tmp -include /disk0/scratch/smonsees/yocto/workspace_1/builds2/sbcb-default/tmp/work/x86_64-linux/intel-graphics-compiler-native/1.0.11-r0/build/IGC/Release/bif/./opencl_cth.h -I /disk0/scratch/smonsees/yocto/workspace_1/builds2/sbcb-default/tmp/work/x86_64-linux/intel-graphics-compiler-native/1.0.11-r0/git/IGC/BiFModule/Languages/OpenCL -I /disk0/scratch/smonsees/yocto/workspace_1/builds2/sbcb-default/tmp/work/x86_64-linux/intel-graphics-compiler-native/1.0.11-r0/git/IGC/BiFModule/Languages/OpenCL/PointerSize -I /disk0/scratch/smonsees/yocto/workspace_1/builds2/sbcb-default/tmp/work/x86_64-linux/intel-graphics-compiler-native/1.0.11-r0/git/IGC/BiFModule/Headers -I /disk0/scratch/smonsees/yocto/workspace_1/builds2/sbcb-default/tmp/work/x86_64-linux/intel-graphics-compiler-native/1.0.11-r0/git/IGC/BiFModule/../AdaptorOCL/ocl_igc_shared/device_enqueue -D__EXECUTION_MODEL_DEBUG=1 -D__OPENCL_C_VERSION__=200 -D__IGC_BUILD__ -Dcl_khr_f16 -Dcl_khrfp64 -Dcl_khr_gl_msaa_sharing -Dcl_khr_mipmap_image -Dcl_khr_depth_images -Dcl_intel_subgroups_short -Dcl_intel_subgroups_char -Dcl_intel_subgroups_long -Dcl_intel_64bit_global_atomics_placeholder -D__VME_TYPES_DEFINED__ -finclude-default-header -cl-std=CL2.0 /disk0/scratch/smonsees/yocto/workspace_1/builds2/sbcb-default/tmp/work/x86_64-linux/intel-graphics-compiler-native/1.0.11-r0/git/IGC/BiFModule/Implementation/pointersize.cl
| [8/565] cd /disk0/scratch/smonsees/yocto/workspace_1/builds2/sbcb-default/tmp/work/x86_64-linux/intel-graphics-compiler-native/1.0.11-r0/build/IGC/BiFModule && /disk0/scratch/smonsees/yocto/workspace_1/builds2/sbcb-default/tmp/work/x86_64-linux/intel-graphics-compiler-native/1.0.11-r0/recipe-sysroot-native/usr/bin/cmake -E make_directory /disk0/scratch/smonsees/yocto/workspace_1/builds2/sbcb-default/tmp/work/x86_64-linux/intel-graphics-compiler-native/1.0.11-r0/build/IGC/Release/bif/. && /disk0/scratch/smonsees/yocto/workspace_1/builds2/sbcb-default/tmp/work/x86_64-linux/intel-graphics-compiler-native/1.0.11-r0/recipe-sysroot-native/usr/bin/clang-9 -cc1 -x cl -fblocks -fpreserve-vec3-type -opencl-builtins -triple=spir64 -w -emit-llvm-bc -o /disk0/scratch/smonsees/yocto/workspace_1/builds2/sbcb-default/tmp/work/x86_64-linux/intel-graphics-compiler-native/1.0.11-r0/build/IGC/Release/bif/./IBiF_Impl_int_spirv.bc_IBiF_Impl__cl__0.bc.tmp -include /disk0/scratch/smonsees/yocto/workspace_1/builds2/sbcb-default/tmp/work/x86_64-linux/intel-graphics-compiler-native/1.0.11-r0/build/IGC/Release/bif/./opencl_cth.h -I /disk0/scratch/smonsees/yocto/workspace_1/builds2/sbcb-default/tmp/work/x86_64-linux/intel-graphics-compiler-native/1.0.11-r0/git/IGC/BiFModule/Implementation -I /disk0/scratch/smonsees/yocto/workspace_1/builds2/sbcb-default/tmp/work/x86_64-linux/intel-graphics-compiler-native/1.0.11-r0/git/IGC/BiFModule/Headers -I /disk0/scratch/smonsees/yocto/workspace_1/builds2/sbcb-default/tmp/work/x86_64-linux/intel-graphics-compiler-native/1.0.11-r0/git/IGC/BiFModule/../AdaptorOCL/ocl_igc_interface/device_enqueue -D__EXECUTION_MODEL_DEBUG=1 -D__OPENCL_C_VERSION__=200 -D__IGC_BUILD__ -Dcl_khr_f16 -Dcl_khrfp64 -Dcl_khr_gl_msaa_sharing -Dcl_khr_mipmap_image -Dcl_khr_depth_images -Dcl_intel_subgroups_short -Dcl_intel_subgroups_char -Dcl_intel_subgroups_long -Dcl_intel_64bit_global_atomics_placeholder -D__VME_TYPES_DEFINED__ -finclude-default-header -cl-std=CL2.0 /disk0/scratch/smonsees/yocto/workspace_1/builds2/sbcb-default/tmp/work/x86_64-linux/intel-graphics-compiler-native/1.0.11-r0/git/IGC/BiFModule/Implementation/IBiF_Impl.cl
| ninja: build stopped: subcommand failed.
| WARNING: /disk0/scratch/smonsees/yocto/workspace_1/builds2/sbcb-default/tmp/work/x86_64-linux/intel-graphics-compiler-native/1.0.11-r0/temp/run.do_compile.26870:1 exit 1 from 'VERBOSE=1 cmake --build /disk0/scratch/smonsees/yocto/workspace_1/builds2/sbcb-default/tmp/work/x86_64-linux/intel-graphics-compiler-native/1.0.11-r0/build --target all -- -j 4'
| ERROR: Execution of '/disk0/scratch/smonsees/yocto/workspace_1/builds2/sbcb-default/tmp/work/x86_64-linux/intel-graphics-compiler-native/1.0.11-r0/temp/run.do_compile.26870' failed with exit code 1:
| [1/565] cd /disk0/scratch/smonsees/yocto/workspace_1/builds2/sbcb-default/tmp/work/x86_64-linux/intel-graphics-compiler-native/1.0.11-r0/git/visa && /disk0/scratch/smonsees/yocto/workspace_1/builds2/sbcb-default/tmp/work/x86_64-linux/intel-graphics-compiler-native/1.0.11-r0/recipe-sysroot-native/usr/bin/flex -PCISA -o/disk0/scratch/smonsees/yocto/workspace_1/builds2/sbcb-default/tmp/work/x86_64-linux/intel-graphics-compiler-native/1.0.11-r0/build/IGC/visa/lex.CISA.cpp CISA.l
| CISA.l:486: warning, rule cannot be matched
| [2/565] cd /disk0/scratch/smonsees/yocto/workspace_1/builds2/sbcb-default/tmp/work/x86_64-linux/intel-graphics-compiler-native/1.0.11-r0/build/IGC/BiFModule && /disk0/scratch/smonsees/yocto/workspace_1/builds2/sbcb-default/tmp/work/x86_64-linux/intel-graphics-compiler-native/1.0.11-r0/recipe-sysroot-native/usr/bin/cmake -E make_directory /disk0/scratch/smonsees/yocto/workspace_1/builds2/sbcb-default/tmp/work/x86_64-linux/intel-graphics-compiler-native/1.0.11-r0/build/IGC/Release/bif/. && /disk0/scratch/smonsees/yocto/workspace_1/builds2/sbcb-default/tmp/hosttools/python3 /disk0/scratch/smonsees/yocto/workspace_1/builds2/sbcb-default/tmp/work/x86_64-linux/intel-graphics-compiler-native/1.0.11-r0/git/IGC/BiFModule/concat.py -new /disk0/scratch/smonsees/yocto/workspace_1/builds2/sbcb-default/tmp/work/x86_64-linux/intel-graphics-compiler-native/1.0.11-r0/build/IGC/Release/bif/./opencl_cth.h /disk0/scratch/smonsees/yocto/workspace_1/builds2/sbcb-default/tmp/work/x86_64-linux/intel-graphics-compiler-native/1.0.11-r0/git/IGC/BiFModule/Languages/OpenCL/opencl_cth_released.h /disk0/scratch/smonsees/yocto/workspace_1/builds2/sbcb-default/tmp/work/x86_64-linux/intel-graphics-compiler-native/1.0.11-r0/git/IGC/BiFModule/Languages/OpenCL/PreRelease/opencl_cth_pre_release.h
| [3/565] cd /disk0/scratch/smonsees/yocto/workspace_1/builds2/sbcb-default/tmp/work/x86_64-linux/intel-graphics-compiler-native/1.0.11-r0/build/IGC/autogen/MDAutogen && /disk0/scratch/smonsees/yocto/workspace_1/builds2/sbcb-default/tmp/hosttools/python3 /disk0/scratch/smonsees/yocto/workspace_1/builds2/sbcb-default/tmp/work/x86_64-linux/intel-graphics-compiler-native/1.0.11-r0/git/IGC/common/autogen.py /disk0/scratch/smonsees/yocto/workspace_1/builds2/sbcb-default/tmp/work/x86_64-linux/intel-graphics-compiler-native/1.0.11-r0/git/IGC/common/MDFrameWork.h /disk0/scratch/smonsees/yocto/workspace_1/builds2/sbcb-default/tmp/work/x86_64-linux/intel-graphics-compiler-native/1.0.11-r0/build/IGC/autogen/MDNodeFunctions.gen
| [4/565] cd /disk0/scratch/smonsees/yocto/workspace_1/builds2/sbcb-default/tmp/work/x86_64-linux/intel-graphics-compiler-native/1.0.11-r0/build/IGC/GenISAIntrinsics && /disk0/scratch/smonsees/yocto/workspace_1/builds2/sbcb-default/tmp/hosttools/python3 /disk0/scratch/smonsees/yocto/workspace_1/builds2/sbcb-default/tmp/work/x86_64-linux/intel-graphics-compiler-native/1.0.11-r0/git/IGC/GenISAIntrinsics/Intrinsics.py Intrinsic_definitions.py /disk0/scratch/smonsees/yocto/workspace_1/builds2/sbcb-default/tmp/work/x86_64-linux/intel-graphics-compiler-native/1.0.11-r0/build/IGC/Release/IntrinsicGenISA.gen
| [5/565] /disk0/scratch/smonsees/yocto/workspace_1/builds2/sbcb-default/tmp/hosttools/g++ -DCL_KHR_FP64_EXT -DGHAL3D=USC -DICBE_LINUX -DIGC_CMAKE -DIGC_EXPORTS=1 -DIGC_SPIRV_ENABLED -DINSIDE_PLUGIN -DISTDLIB_UMD -DLINUX -DNDEBUG -DNOMINMAX -DSTD_CALL -DUSC_EXPORTS=1 -DUSE_MMX -DUSE_SSE -DUSE_SSE2 -DUSE_SSE3 -DUSE_SSSE3 -D_AMD64_ -D_COMPILER_DLL_ -D_CRT_SECURE_NO_WARNINGS -D_HAS_EXCEPTIONS=0 -D_IGC_ -D_SCL_SECURE_NO_WARNINGS -D__STDC_CONSTANT_MACROS -D__STDC_LIMIT_MACROS -I/disk0/scratch/smonsees/yocto/workspace_1/builds2/sbcb-default/tmp/work/x86_64-linux/intel-graphics-compiler-native/1.0.11-r0/git/IGC/WrapperLLVM/include -IIGC/autogen -I/disk0/scratch/smonsees/yocto/workspace_1/builds2/sbcb-default/tmp/work/x86_64-linux/intel-graphics-compiler-native/1.0.11-r0/git/IGC -I/disk0/scratch/smonsees/yocto/workspace_1/builds2/sbcb-default/tmp/work/x86_64-linux/intel-graphics-compiler-native/1.0.11-r0/git/IGC/common -I/disk0/scratch/smonsees/yocto/workspace_1/builds2/sbcb-default/tmp/work/x86_64-linux/intel-graphics-compiler-native/1.0.11-r0/git/IGC/.. -I/disk0/scratch/smonsees/yocto/workspace_1/builds2/sbcb-default/tmp/work/x86_64-linux/intel-graphics-compiler-native/1.0.11-r0/git/IGC/../Common -I/disk0/scratch/smonsees/yocto/workspace_1/builds2/sbcb-default/tmp/work/x86_64-linux/intel-graphics-compiler-native/1.0.11-r0/git/IGC/../3d/common -I/disk0/scratch/smonsees/yocto/workspace_1/builds2/sbcb-default/tmp/work/x86_64-linux/intel-graphics-compiler-native/1.0.11-r0/git/IGC/../inc -I/disk0/scratch/smonsees/yocto/workspace_1/builds2/sbcb-default/tmp/work/x86_64-linux/intel-graphics-compiler-native/1.0.11-r0/git/IGC/../inc/common -I/disk0/scratch/smonsees/yocto/workspace_1/builds2/sbcb-default/tmp/work/x86_64-linux/intel-graphics-compiler-native/1.0.11-r0/git/IGC/../inc/common/Compiler -I/disk0/scratch/smonsees/yocto/workspace_1/builds2/sbcb-default/tmp/work/x86_64-linux/intel-graphics-compiler-native/1.0.11-r0/git/IGC/../inc/common/Compiler/API -I/disk0/scratch/smonsees/yocto/workspace_1/builds2/sbcb-default/tmp/work/x86_64-linux/intel-graphics-compiler-native/1.0.11-r0/git/IGC/../visa/include -IIGC/Release -I/disk0/scratch/smonsees/yocto/workspace_1/builds2/sbcb-default/tmp/work/x86_64-linux/intel-graphics-compiler-native/1.0.11-r0/git/IGC/AdaptorOCL/ocl_igc_shared/executable_format -I/disk0/scratch/smonsees/yocto/workspace_1/builds2/sbcb-default/tmp/work/x86_64-linux/intel-graphics-compiler-native/1.0.11-r0/git/IGC/AdaptorOCL -I/disk0/scratch/smonsees/yocto/workspace_1/builds2/sbcb-default/tmp/work/x86_64-linux/intel-graphics-compiler-native/1.0.11-r0/git/IGC/../inc/common/Compiler/common -I/disk0/scratch/smonsees/yocto/workspace_1/builds2/sbcb-default/tmp/work/x86_64-linux/intel-graphics-compiler-native/1.0.11-r0/git/IGC/AdaptorOCL/cif/cif/.. -I/disk0/scratch/smonsees/yocto/workspace_1/builds2/sbcb-default/tmp/work/x86_64-linux/intel-graphics-compiler-native/1.0.11-r0/git/IGC/GenISAIntrinsics -isystem/disk0/scratch/smonsees/yocto/workspace_1/builds2/sbcb-default/tmp/work/x86_64-linux/intel-graphics-compiler-native/1.0.11-r0/recipe-sysroot-native/usr/include -pipe -fno-exceptions -fdata-sections -ffunction-sections -O2 -fmessage-length=0 -march=corei7 -mstackrealign -fms-extensions -Werror -Wno-unused-parameter -Wno-missing-field-initializers -Wwrite-strings -Wno-long-long -Wswitch -Wno-sign-compare -Wno-unused-result -Wno-enum-compare -Wno-type-limits -Wno-ignored-qualifiers -Wformat -Wformat-security -Wno-extra -Wno-write-strings -finline -fno-strict-aliasing -msse -msse2 -msse3 -mssse3 -msse4 -msse4.1 -msse4.2 -Wno-unknown-pragmas -fPIC -D_FORTIFY_SOURCE=2 -fstack-protector -finline-functions -funswitch-loops -Wno-maybe-uninitialized -lrt -fno-rtti -fvisibility=hidden -fvisibility-inlines-hidden -std=c++14 -DNDEBUG -g -std=gnu++1y -MD -MT IGC/GenISAIntrinsics/CMakeFiles/GenISAIntrinsics.dir/GenIntrinsics.cpp.o -MF IGC/GenISAIntrinsics/CMakeFiles/GenISAIntrinsics.dir/GenIntrinsics.cpp.o.d -o IGC/GenISAIntrinsics/CMakeFiles/GenISAIntrinsics.dir/GenIntrinsics.cpp.o -c /disk0/scratch/smonsees/yocto/workspace_1/builds2/sbcb-default/tmp/work/x86_64-linux/intel-graphics-compiler-native/1.0.11-r0/git/IGC/GenISAIntrinsics/GenIntrinsics.cpp
| FAILED: IGC/GenISAIntrinsics/CMakeFiles/GenISAIntrinsics.dir/GenIntrinsics.cpp.o
| /disk0/scratch/smonsees/yocto/workspace_1/builds2/sbcb-default/tmp/hosttools/g++ -DCL_KHR_FP64_EXT -DGHAL3D=USC -DICBE_LINUX -DIGC_CMAKE -DIGC_EXPORTS=1 -DIGC_SPIRV_ENABLED -DINSIDE_PLUGIN -DISTDLIB_UMD -DLINUX -DNDEBUG -DNOMINMAX -DSTD_CALL -DUSC_EXPORTS=1 -DUSE_MMX -DUSE_SSE -DUSE_SSE2 -DUSE_SSE3 -DUSE_SSSE3 -D_AMD64_ -D_COMPILER_DLL_ -D_CRT_SECURE_NO_WARNINGS -D_HAS_EXCEPTIONS=0 -D_IGC_ -D_SCL_SECURE_NO_WARNINGS -D__STDC_CONSTANT_MACROS -D__STDC_LIMIT_MACROS -I/disk0/scratch/smonsees/yocto/workspace_1/builds2/sbcb-default/tmp/work/x86_64-linux/intel-graphics-compiler-native/1.0.11-r0/git/IGC/WrapperLLVM/include -IIGC/autogen -I/disk0/scratch/smonsees/yocto/workspace_1/builds2/sbcb-default/tmp/work/x86_64-linux/intel-graphics-compiler-native/1.0.11-r0/git/IGC -I/disk0/scratch/smonsees/yocto/workspace_1/builds2/sbcb-default/tmp/work/x86_64-linux/intel-graphics-compiler-native/1.0.11-r0/git/IGC/common -I/disk0/scratch/smonsees/yocto/workspace_1/builds2/sbcb-default/tmp/work/x86_64-linux/intel-graphics-compiler-native/1.0.11-r0/git/IGC/.. -I/disk0/scratch/smonsees/yocto/workspace_1/builds2/sbcb-default/tmp/work/x86_64-linux/intel-graphics-compiler-native/1.0.11-r0/git/IGC/../Common -I/disk0/scratch/smonsees/yocto/workspace_1/builds2/sbcb-default/tmp/work/x86_64-linux/intel-graphics-compiler-native/1.0.11-r0/git/IGC/../3d/common -I/disk0/scratch/smonsees/yocto/workspace_1/builds2/sbcb-default/tmp/work/x86_64-linux/intel-graphics-compiler-native/1.0.11-r0/git/IGC/../inc -I/disk0/scratch/smonsees/yocto/workspace_1/builds2/sbcb-default/tmp/work/x86_64-linux/intel-graphics-compiler-native/1.0.11-r0/git/IGC/../inc/common -I/disk0/scratch/smonsees/yocto/workspace_1/builds2/sbcb-default/tmp/work/x86_64-linux/intel-graphics-compiler-native/1.0.11-r0/git/IGC/../inc/common/Compiler -I/disk0/scratch/smonsees/yocto/workspace_1/builds2/sbcb-default/tmp/work/x86_64-linux/intel-graphics-compiler-native/1.0.11-r0/git/IGC/../inc/common/Compiler/API -I/disk0/scratch/smonsees/yocto/workspace_1/builds2/sbcb-default/tmp/work/x86_64-linux/intel-graphics-compiler-native/1.0.11-r0/git/IGC/../visa/include -IIGC/Release -I/disk0/scratch/smonsees/yocto/workspace_1/builds2/sbcb-default/tmp/work/x86_64-linux/intel-graphics-compiler-native/1.0.11-r0/git/IGC/AdaptorOCL/ocl_igc_shared/executable_format -I/disk0/scratch/smonsees/yocto/workspace_1/builds2/sbcb-default/tmp/work/x86_64-linux/intel-graphics-compiler-native/1.0.11-r0/git/IGC/AdaptorOCL -I/disk0/scratch/smonsees/yocto/workspace_1/builds2/sbcb-default/tmp/work/x86_64-linux/intel-graphics-compiler-native/1.0.11-r0/git/IGC/../inc/common/Compiler/common -I/disk0/scratch/smonsees/yocto/workspace_1/builds2/sbcb-default/tmp/work/x86_64-linux/intel-graphics-compiler-native/1.0.11-r0/git/IGC/AdaptorOCL/cif/cif/.. -I/disk0/scratch/smonsees/yocto/workspace_1/builds2/sbcb-default/tmp/work/x86_64-linux/intel-graphics-compiler-native/1.0.11-r0/git/IGC/GenISAIntrinsics -isystem/disk0/scratch/smonsees/yocto/workspace_1/builds2/sbcb-default/tmp/work/x86_64-linux/intel-graphics-compiler-native/1.0.11-r0/recipe-sysroot-native/usr/include -pipe -fno-exceptions -fdata-sections -ffunction-sections -O2 -fmessage-length=0 -march=corei7 -mstackrealign -fms-extensions -Werror -Wno-unused-parameter -Wno-missing-field-initializers -Wwrite-strings -Wno-long-long -Wswitch -Wno-sign-compare -Wno-unused-result -Wno-enum-compare -Wno-type-limits -Wno-ignored-qualifiers -Wformat -Wformat-security -Wno-extra -Wno-write-strings -finline -fno-strict-aliasing -msse -msse2 -msse3 -mssse3 -msse4 -msse4.1 -msse4.2 -Wno-unknown-pragmas -fPIC -D_FORTIFY_SOURCE=2 -fstack-protector -finline-functions -funswitch-loops -Wno-maybe-uninitialized -lrt -fno-rtti -fvisibility=hidden -fvisibility-inlines-hidden -std=c++14 -DNDEBUG -g -std=gnu++1y -MD -MT IGC/GenISAIntrinsics/CMakeFiles/GenISAIntrinsics.dir/GenIntrinsics.cpp.o -MF IGC/GenISAIntrinsics/CMakeFiles/GenISAIntrinsics.dir/GenIntrinsics.cpp.o.d -o IGC/GenISAIntrinsics/CMakeFiles/GenISAIntrinsics.dir/GenIntrinsics.cpp.o -c /disk0/scratch/smonsees/yocto/workspace_1/builds2/sbcb-default/tmp/work/x86_64-linux/intel-graphics-compiler-native/1.0.11-r0/git/IGC/GenISAIntrinsics/GenIntrinsics.cpp
| g++: error: unrecognized command line option ‘-std=c++14’
| [6/565] cd /disk0/scratch/smonsees/yocto/workspace_1/builds2/sbcb-default/tmp/work/x86_64-linux/intel-graphics-compiler-native/1.0.11-r0/git/visa && /disk0/scratch/smonsees/yocto/workspace_1/builds2/sbcb-default/tmp/work/x86_64-linux/intel-graphics-compiler-native/1.0.11-r0/recipe-sysroot-native/usr/bin/bison -vt -p CISA -d -o /disk0/scratch/smonsees/yocto/workspace_1/builds2/sbcb-default/tmp/work/x86_64-linux/intel-graphics-compiler-native/1.0.11-r0/build/IGC/visa/CISA.tab.cpp CISA.y
| CISA.y:84.1-14: warning: deprecated directive, use ‘%define parse.error verbose’ [-Wdeprecated]
| 84 | %error-verbose
| | ^~~~~~~~~~~~~~
| CISA.y: warning: 1 nonterminal useless in grammar [-Wother]
| CISA.y: warning: 1 rule useless in grammar [-Wother]
| CISA.y:1478.1-16: warning: nonterminal useless in grammar: VecSrcOpndSimple [-Wother]
| 1478 | VecSrcOpndSimple : VAR TwoDimOffset
| | ^~~~~~~~~~~~~~~~
| CISA.y: warning: 140 shift/reduce conflicts [-Wconflicts-sr]
| CISA.y: warning: 20 reduce/reduce conflicts [-Wconflicts-rr]
| CISA.y: warning: fix-its can be applied. Rerun with option '--update'. [-Wother]
| [7/565] cd /disk0/scratch/smonsees/yocto/workspace_1/builds2/sbcb-default/tmp/work/x86_64-linux/intel-graphics-compiler-native/1.0.11-r0/build/IGC/BiFModule && /disk0/scratch/smonsees/yocto/workspace_1/builds2/sbcb-default/tmp/work/x86_64-linux/intel-graphics-compiler-native/1.0.11-r0/recipe-sysroot-native/usr/bin/cmake -E make_directory /disk0/scratch/smonsees/yocto/workspace_1/builds2/sbcb-default/tmp/work/x86_64-linux/intel-graphics-compiler-native/1.0.11-r0/build/IGC/Release/bif/. && /disk0/scratch/smonsees/yocto/workspace_1/builds2/sbcb-default/tmp/work/x86_64-linux/intel-graphics-compiler-native/1.0.11-r0/recipe-sysroot-native/usr/bin/clang-9 -cc1 -x cl -fblocks -fpreserve-vec3-type -opencl-builtins -triple=spir64 -w -emit-llvm-bc -o /disk0/scratch/smonsees/yocto/workspace_1/builds2/sbcb-default/tmp/work/x86_64-linux/intel-graphics-compiler-native/1.0.11-r0/build/IGC/Release/bif/./IBiF_spirv_size_t_64.bc_pointersize__cl__0.bc.tmp -include /disk0/scratch/smonsees/yocto/workspace_1/builds2/sbcb-default/tmp/work/x86_64-linux/intel-graphics-compiler-native/1.0.11-r0/build/IGC/Release/bif/./opencl_cth.h -I /disk0/scratch/smonsees/yocto/workspace_1/builds2/sbcb-default/tmp/work/x86_64-linux/intel-graphics-compiler-native/1.0.11-r0/git/IGC/BiFModule/Languages/OpenCL -I /disk0/scratch/smonsees/yocto/workspace_1/builds2/sbcb-default/tmp/work/x86_64-linux/intel-graphics-compiler-native/1.0.11-r0/git/IGC/BiFModule/Languages/OpenCL/PointerSize -I /disk0/scratch/smonsees/yocto/workspace_1/builds2/sbcb-default/tmp/work/x86_64-linux/intel-graphics-compiler-native/1.0.11-r0/git/IGC/BiFModule/Headers -I /disk0/scratch/smonsees/yocto/workspace_1/builds2/sbcb-default/tmp/work/x86_64-linux/intel-graphics-compiler-native/1.0.11-r0/git/IGC/BiFModule/../AdaptorOCL/ocl_igc_shared/device_enqueue -D__EXECUTION_MODEL_DEBUG=1 -D__OPENCL_C_VERSION__=200 -D__IGC_BUILD__ -Dcl_khr_f16 -Dcl_khrfp64 -Dcl_khr_gl_msaa_sharing -Dcl_khr_mipmap_image -Dcl_khr_depth_images -Dcl_intel_subgroups_short -Dcl_intel_subgroups_char -Dcl_intel_subgroups_long -Dcl_intel_64bit_global_atomics_placeholder -D__VME_TYPES_DEFINED__ -finclude-default-header -cl-std=CL2.0 /disk0/scratch/smonsees/yocto/workspace_1/builds2/sbcb-default/tmp/work/x86_64-linux/intel-graphics-compiler-native/1.0.11-r0/git/IGC/BiFModule/Implementation/pointersize.cl
| [8/565] cd /disk0/scratch/smonsees/yocto/workspace_1/builds2/sbcb-default/tmp/work/x86_64-linux/intel-graphics-compiler-native/1.0.11-r0/build/IGC/BiFModule && /disk0/scratch/smonsees/yocto/workspace_1/builds2/sbcb-default/tmp/work/x86_64-linux/intel-graphics-compiler-native/1.0.11-r0/recipe-sysroot-native/usr/bin/cmake -E make_directory /disk0/scratch/smonsees/yocto/workspace_1/builds2/sbcb-default/tmp/work/x86_64-linux/intel-graphics-compiler-native/1.0.11-r0/build/IGC/Release/bif/. && /disk0/scratch/smonsees/yocto/workspace_1/builds2/sbcb-default/tmp/work/x86_64-linux/intel-graphics-compiler-native/1.0.11-r0/recipe-sysroot-native/usr/bin/clang-9 -cc1 -x cl -fblocks -fpreserve-vec3-type -opencl-builtins -triple=spir64 -w -emit-llvm-bc -o /disk0/scratch/smonsees/yocto/workspace_1/builds2/sbcb-default/tmp/work/x86_64-linux/intel-graphics-compiler-native/1.0.11-r0/build/IGC/Release/bif/./IBiF_Impl_int_spirv.bc_IBiF_Impl__cl__0.bc.tmp -include /disk0/scratch/smonsees/yocto/workspace_1/builds2/sbcb-default/tmp/work/x86_64-linux/intel-graphics-compiler-native/1.0.11-r0/build/IGC/Release/bif/./opencl_cth.h -I /disk0/scratch/smonsees/yocto/workspace_1/builds2/sbcb-default/tmp/work/x86_64-linux/intel-graphics-compiler-native/1.0.11-r0/git/IGC/BiFModule/Implementation -I /disk0/scratch/smonsees/yocto/workspace_1/builds2/sbcb-default/tmp/work/x86_64-linux/intel-graphics-compiler-native/1.0.11-r0/git/IGC/BiFModule/Headers -I /disk0/scratch/smonsees/yocto/workspace_1/builds2/sbcb-default/tmp/work/x86_64-linux/intel-graphics-compiler-native/1.0.11-r0/git/IGC/BiFModule/../AdaptorOCL/ocl_igc_interface/device_enqueue -D__EXECUTION_MODEL_DEBUG=1 -D__OPENCL_C_VERSION__=200 -D__IGC_BUILD__ -Dcl_khr_f16 -Dcl_khrfp64 -Dcl_khr_gl_msaa_sharing -Dcl_khr_mipmap_image -Dcl_khr_depth_images -Dcl_intel_subgroups_short -Dcl_intel_subgroups_char -Dcl_intel_subgroups_long -Dcl_intel_64bit_global_atomics_placeholder -D__VME_TYPES_DEFINED__ -finclude-default-header -cl-std=CL2.0 /disk0/scratch/smonsees/yocto/workspace_1/builds2/sbcb-default/tmp/work/x86_64-linux/intel-graphics-compiler-native/1.0.11-r0/git/IGC/BiFModule/Implementation/IBiF_Impl.cl
| ninja: build stopped: subcommand failed.
| WARNING: /disk0/scratch/smonsees/yocto/workspace_1/builds2/sbcb-default/tmp/work/x86_64-linux/intel-graphics-compiler-native/1.0.11-r0/temp/run.do_compile.26870:1 exit 1 from 'VERBOSE=1 cmake --build /disk0/scratch/smonsees/yocto/workspace_1/builds2/sbcb-default/tmp/work/x86_64-linux/intel-graphics-compiler-native/1.0.11-r0/build --target all -- -j 4'
|

-----Original Message-----
From: yocto@... <yocto@...> On Behalf Of Monsees, Steven C (US) via lists.yoctoproject.org
Sent: Tuesday, October 12, 2021 7:22 AM
To: Mittal, Anuj <anuj.mittal@...>; yocto@...
Subject: Re: [yocto] #zeus meta-intel

External Email Alert

This email has been sent from an account outside of the BAE Systems network.

Please treat the email with caution, especially if you are requested to click on a link, decrypt/open an attachment, or enable macros. For further information on how to spot phishing, access “Cybersecurity OneSpace Page” and report phishing by clicking the button “Report Phishing” on the Outlook toolbar.



Anuj:

Are there any other possible dependencies for the “meta-intel/dynamic-layers/clang-layer/recipes-
opencl” ?

Is this dependent on systemd ?

It appears to builds clean, but fails/faults while booting kernel...

Thanks again,
Steve

-----Original Message-----
From: Mittal, Anuj <anuj.mittal@...>
Sent: Friday, October 8, 2021 11:05 PM
To: Monsees, Steven C (US) <steven.monsees@...>; yocto@...
Subject: Re: [yocto] #zeus meta-intel

External Email Alert

This email has been sent from an account outside of the BAE Systems network.

Please treat the email with caution, especially if you are requested to click on a link, decrypt/open an attachment, or enable macros. For further information on how to spot phishing, access “Cybersecurity OneSpace Page” and report phishing by clicking the button “Report Phishing” on the Outlook toolbar.


On Fri, 2021-10-08 at 16:10 +0000, Monsees, Steven C (US) via lists.yoctoproject.org wrote:

Sorry for my ignorance, but I am missing your point, what exactly does
the recipe provide when built, intel-opencl-icd ?, will it pull in igc
?
It will pull in igc. There's a separate recipe for igc in meta-intel.
compute-runtime will provide intel-opencl-icd but the package name is different.

You can try building the recipe.

Thanks,

Anuj


-----Original Message-----
From: Mittal, Anuj <anuj.mittal@...>
Sent: Friday, October 8, 2021 12:01 PM
To: Monsees, Steven C (US) <steven.monsees@...>;
yocto@...
Subject: Re: [yocto] #zeus meta-intel

External Email Alert

This email has been sent from an account outside of the BAE Systems
network.

Please treat the email with caution, especially if you are requested
to click on a link, decrypt/open an attachment, or enable macros.
For further information on how to spot phishing, access “Cybersecurity
OneSpace Page” and report phishing by clicking the button “Report
Phishing” on the Outlook toolbar.


Sorry, I didn't understand the question. If you want to know which
version of OpenCL is supported, please see the README for version that
you're building. Also see:

https://github.com/intel/compute-runtime/blob/master/opencl/doc/FAQ.md

Thanks,

Anuj

On Fri, 2021-10-08 at 15:30 +0000, Monsees, Steven C (US) wrote:

Thank you, just for clarification ...

"Building the Neo driver", does that mean no OpenCL library support
?

-----Original Message-----
From: Mittal, Anuj <anuj.mittal@...>
Sent: Friday, October 8, 2021 11:07 AM
To: Monsees, Steven C (US) <steven.monsees@...>;
yocto@...
Subject: Re: [yocto] #zeus meta-intel

External Email Alert

This email has been sent from an account outside of the BAE Systems
network.

Please treat the email with caution, especially if you are requested
to click on a link, decrypt/open an attachment, or enable macros.
For
further information on how to spot phishing, access “Cybersecurity
OneSpace Page” and report phishing by clicking the button “Report
Phishing” on the Outlook toolbar.


On Thu, 2021-10-07 at 16:20 +0000, Monsees, Steven C (US) via
lists.yoctoproject.org wrote:
 
 
I am looking at “meta-intel/dynamic-layers/clang-layer/recipes-
opencl/compute-runtime”
I have been “told” that this compute-runtime recipe should
basically build opencl (Neo) with all the required dependencies… I
did not think Yocto had support for OpenCL, and was looking to
build Neo under the SDK.
 
(1)   Is this true, does meta-intell under zeus now support
building OpenCL and the OpenCL Graphics compiler under Yocto ?
compute-runtime recipe would allow you to build NEO driver. zeus is
no longer maintained so the version there is old and not tested now
but it should still build.

(2)   Of so, what would be the proper way to pull this into my
yocto build ?
Including meta-intel and meta-clang in bblayers should be enough.

Thanks,

Anuj



Using meta-qt5-extra layer build KDE support on riscv target #yocto

sateesh m
 

Hi Guys,

I am facing bellow error while building KDE support using meta-qt5-extra layer.can any body know please suggest me how can i fix this problem.

I have added already qttools -> this will provide Qt5LinguistTools but getting below error.

Error displayed:
 
CMake Error at /usr/share/ECM/modules/ECMPoQmTools.cmake:144 (find_package):   Could not find a package configuration file provided by "Qt5LinguistTools"
  with any of the following names:

    Qt5LinguistToolsConfig.cmake
    qt5linguisttools-config.cmake

  Add the installation prefix of "Qt5LinguistTools" to CMAKE_PREFIX_PATH or
  set "Qt5LinguistTools_DIR" to a directory containing one of the above
  files.  If "Qt5LinguistTools" provides a separate development package or
  SDK, be sure it has been installed.
Call Stack (most recent call first):
  /usr/share/ECM/modules/ECMPoQmTools.cmake:234 (ecm_process_po_files_as_qm)
  CMakeLists.txt:317 (ecm_install_po_files_as_qm)


-- Configuring incomplete, errors occurred!
See also "/usr/src/kde/phonon-4.10.3/build/CMakeFiles/CMakeOutput.log".
 
--
Regards,
Sateesh


Re: #zeus meta-intel #zeus

Monsees, Steven C (US)
 

Anuj:

Are there any other possible dependencies for the “meta-intel/dynamic-layers/clang-layer/recipes-
opencl” ?

Is this dependent on systemd ?

It appears to builds clean, but fails/faults while booting kernel...

Thanks again,
Steve

-----Original Message-----
From: Mittal, Anuj <anuj.mittal@...>
Sent: Friday, October 8, 2021 11:05 PM
To: Monsees, Steven C (US) <steven.monsees@...>; yocto@...
Subject: Re: [yocto] #zeus meta-intel

External Email Alert

This email has been sent from an account outside of the BAE Systems network.

Please treat the email with caution, especially if you are requested to click on a link, decrypt/open an attachment, or enable macros. For further information on how to spot phishing, access “Cybersecurity OneSpace Page” and report phishing by clicking the button “Report Phishing” on the Outlook toolbar.


On Fri, 2021-10-08 at 16:10 +0000, Monsees, Steven C (US) via lists.yoctoproject.org wrote:

Sorry for my ignorance, but I am missing your point, what exactly does
the recipe provide when built, intel-opencl-icd ?, will it pull in igc
?
It will pull in igc. There's a separate recipe for igc in meta-intel.
compute-runtime will provide intel-opencl-icd but the package name is different.

You can try building the recipe.

Thanks,

Anuj


-----Original Message-----
From: Mittal, Anuj <anuj.mittal@...>
Sent: Friday, October 8, 2021 12:01 PM
To: Monsees, Steven C (US) <steven.monsees@...>;
yocto@...
Subject: Re: [yocto] #zeus meta-intel

External Email Alert

This email has been sent from an account outside of the BAE Systems
network.

Please treat the email with caution, especially if you are requested
to click on a link, decrypt/open an attachment, or enable macros.
For further information on how to spot phishing, access “Cybersecurity
OneSpace Page” and report phishing by clicking the button “Report
Phishing” on the Outlook toolbar.


Sorry, I didn't understand the question. If you want to know which
version of OpenCL is supported, please see the README for version that
you're building. Also see:

https://github.com/intel/compute-runtime/blob/master/opencl/doc/FAQ.md

Thanks,

Anuj

On Fri, 2021-10-08 at 15:30 +0000, Monsees, Steven C (US) wrote:

Thank you, just for clarification ...

"Building the Neo driver", does that mean no OpenCL library support
?

-----Original Message-----
From: Mittal, Anuj <anuj.mittal@...>
Sent: Friday, October 8, 2021 11:07 AM
To: Monsees, Steven C (US) <steven.monsees@...>;
yocto@...
Subject: Re: [yocto] #zeus meta-intel

External Email Alert

This email has been sent from an account outside of the BAE Systems
network.

Please treat the email with caution, especially if you are requested
to click on a link, decrypt/open an attachment, or enable macros.
For
further information on how to spot phishing, access “Cybersecurity
OneSpace Page” and report phishing by clicking the button “Report
Phishing” on the Outlook toolbar.


On Thu, 2021-10-07 at 16:20 +0000, Monsees, Steven C (US) via
lists.yoctoproject.org wrote:
 
 
I am looking at “meta-intel/dynamic-layers/clang-layer/recipes-
opencl/compute-runtime”
I have been “told” that this compute-runtime recipe should
basically build opencl (Neo) with all the required dependencies… I
did not think Yocto had support for OpenCL, and was looking to
build Neo under the SDK.
 
(1)   Is this true, does meta-intell under zeus now support
building OpenCL and the OpenCL Graphics compiler under Yocto ?
compute-runtime recipe would allow you to build NEO driver. zeus is
no longer maintained so the version there is old and not tested now
but it should still build.

(2)   Of so, what would be the proper way to pull this into my
yocto build ?
Including meta-intel and meta-clang in bblayers should be enough.

Thanks,

Anuj



[meta-selinux][PATCH 3/4] selinux-python: add RDEPENDES on audit-python

Yi Zhao
 

Add RDEPENDS on audit-python for selinux-python-semanage.

Fixes:
$ semanage fcontext -a -t user_home_t "/web(/.*)?"
Traceback (most recent call last):
File "/usr/sbin/semanage", line 975, in <module>
do_parser()
File "/usr/sbin/semanage", line 947, in do_parser
args.func(args)
File "/usr/sbin/semanage", line 329, in handleFcontext
OBJECT.add(args.file_spec, args.type, args.ftype, args.range, args.seuser)
File "/usr/lib/python3.9/site-packages/seobject.py", line 2485, in add
self.__add(target, type, ftype, serange, seuser)
File "/usr/lib/python3.9/site-packages/seobject.py", line 2481, in __add
self.mylog.log_change("resrc=fcontext op=add %s ftype=%s tcontext=%s:%s:%s:%s"
% (audit.audit_encode_nv_string("tglob", target, 0), ftype_to_audit[ftype],)
NameError: name 'audit' is not defined

Signed-off-by: Yi Zhao <yi.zhao@...>
---
recipes-security/selinux/selinux-python_3.2.bb | 1 +
1 file changed, 1 insertion(+)

diff --git a/recipes-security/selinux/selinux-python_3.2.bb b/recipes-security/selinux/selinux-python_3.2.bb
index a954676..d130900 100644
--- a/recipes-security/selinux/selinux-python_3.2.bb
+++ b/recipes-security/selinux/selinux-python_3.2.bb
@@ -50,6 +50,7 @@ RDEPENDS:${BPN}-semanage += "\
python3-xml \
python3-misc \
libselinux-python \
+ audit-python \
${BPN} \
"
RDEPENDS:${BPN}-sepolicy += "\
--
2.25.1


[meta-selinux][PATCH 1/4] libselinux: inherit pkgconfig

Yi Zhao
 

Inherit pkgconfig to fix the build error which is introduced by
oe-commit:
commit 8e26252b45b7660c7c67c702411bdec187a76ffc
Author: Richard Purdie <richard.purdie@...>
Date: Sun Sep 19 16:17:31 2021 +0100

layer.conf: Extend recipes not to install without explict dependencies

Fixes:
make: pkg-config: Command not found
/usr/src/debug/libselinux/3.2-r0/git/libselinux/src/regex.c:399: undefined reference to `pcre_fullinfo'
/usr/src/debug/libselinux/3.3-r0/git/libselinux/src/regex.c:444: undefined reference to `pcre_free'
/usr/src/debug/libselinux/3.3-r0/git/libselinux/src/regex.c:456: undefined reference to `pcre_exec'

Signed-off-by: Yi Zhao <yi.zhao@...>
---
recipes-security/selinux/libselinux_3.2.bb | 2 +-
1 file changed, 1 insertion(+), 1 deletion(-)

diff --git a/recipes-security/selinux/libselinux_3.2.bb b/recipes-security/selinux/libselinux_3.2.bb
index 55efbae..1144840 100644
--- a/recipes-security/selinux/libselinux_3.2.bb
+++ b/recipes-security/selinux/libselinux_3.2.bb
@@ -8,7 +8,7 @@ LIC_FILES_CHKSUM = "file://${S}/LICENSE;md5=84b4d2c6ef954a2d4081e775a270d0d0"

require selinux_common.inc

-inherit lib_package python3native
+inherit lib_package python3native pkgconfig

DEPENDS += "libsepol libpcre"
DEPENDS:append:libc-musl = " fts"
--
2.25.1


[meta-selinux][PATCH 4/4] selinux: move selinux scripts to selinux-scripts

Yi Zhao
 

There are too many recipes in recipes-security/selinux. Keep the selinux
userspace recipes and move selinux scripts to selinux-scripts directory
to make the directory hierarchy clearer.

Signed-off-by: Yi Zhao <yi.zhao@...>
---
.../selinux-autorelabel/selinux-autorelabel.service | 0
.../selinux-autorelabel/selinux-autorelabel.sh | 0
.../{selinux => selinux-scripts}/selinux-autorelabel_0.1.bb | 0
.../selinux-init/selinux-init.service | 0
.../{selinux => selinux-scripts}/selinux-init/selinux-init.sh | 0
.../selinux-init/selinux-init.sh.sysvinit | 0
recipes-security/{selinux => selinux-scripts}/selinux-init_0.1.bb | 0
recipes-security/{selinux => selinux-scripts}/selinux-initsh.inc | 0
.../selinux-labeldev/selinux-labeldev.service | 0
.../selinux-labeldev/selinux-labeldev.sh | 0
.../{selinux => selinux-scripts}/selinux-labeldev_0.1.bb | 0
11 files changed, 0 insertions(+), 0 deletions(-)
rename recipes-security/{selinux => selinux-scripts}/selinux-autorelabel/selinux-autorelabel.service (100%)
rename recipes-security/{selinux => selinux-scripts}/selinux-autorelabel/selinux-autorelabel.sh (100%)
rename recipes-security/{selinux => selinux-scripts}/selinux-autorelabel_0.1.bb (100%)
rename recipes-security/{selinux => selinux-scripts}/selinux-init/selinux-init.service (100%)
rename recipes-security/{selinux => selinux-scripts}/selinux-init/selinux-init.sh (100%)
rename recipes-security/{selinux => selinux-scripts}/selinux-init/selinux-init.sh.sysvinit (100%)
rename recipes-security/{selinux => selinux-scripts}/selinux-init_0.1.bb (100%)
rename recipes-security/{selinux => selinux-scripts}/selinux-initsh.inc (100%)
rename recipes-security/{selinux => selinux-scripts}/selinux-labeldev/selinux-labeldev.service (100%)
rename recipes-security/{selinux => selinux-scripts}/selinux-labeldev/selinux-labeldev.sh (100%)
rename recipes-security/{selinux => selinux-scripts}/selinux-labeldev_0.1.bb (100%)

diff --git a/recipes-security/selinux/selinux-autorelabel/selinux-autorelabel.service b/recipes-security/selinux-scripts/selinux-autorelabel/selinux-autorelabel.service
similarity index 100%
rename from recipes-security/selinux/selinux-autorelabel/selinux-autorelabel.service
rename to recipes-security/selinux-scripts/selinux-autorelabel/selinux-autorelabel.service
diff --git a/recipes-security/selinux/selinux-autorelabel/selinux-autorelabel.sh b/recipes-security/selinux-scripts/selinux-autorelabel/selinux-autorelabel.sh
similarity index 100%
rename from recipes-security/selinux/selinux-autorelabel/selinux-autorelabel.sh
rename to recipes-security/selinux-scripts/selinux-autorelabel/selinux-autorelabel.sh
diff --git a/recipes-security/selinux/selinux-autorelabel_0.1.bb b/recipes-security/selinux-scripts/selinux-autorelabel_0.1.bb
similarity index 100%
rename from recipes-security/selinux/selinux-autorelabel_0.1.bb
rename to recipes-security/selinux-scripts/selinux-autorelabel_0.1.bb
diff --git a/recipes-security/selinux/selinux-init/selinux-init.service b/recipes-security/selinux-scripts/selinux-init/selinux-init.service
similarity index 100%
rename from recipes-security/selinux/selinux-init/selinux-init.service
rename to recipes-security/selinux-scripts/selinux-init/selinux-init.service
diff --git a/recipes-security/selinux/selinux-init/selinux-init.sh b/recipes-security/selinux-scripts/selinux-init/selinux-init.sh
similarity index 100%
rename from recipes-security/selinux/selinux-init/selinux-init.sh
rename to recipes-security/selinux-scripts/selinux-init/selinux-init.sh
diff --git a/recipes-security/selinux/selinux-init/selinux-init.sh.sysvinit b/recipes-security/selinux-scripts/selinux-init/selinux-init.sh.sysvinit
similarity index 100%
rename from recipes-security/selinux/selinux-init/selinux-init.sh.sysvinit
rename to recipes-security/selinux-scripts/selinux-init/selinux-init.sh.sysvinit
diff --git a/recipes-security/selinux/selinux-init_0.1.bb b/recipes-security/selinux-scripts/selinux-init_0.1.bb
similarity index 100%
rename from recipes-security/selinux/selinux-init_0.1.bb
rename to recipes-security/selinux-scripts/selinux-init_0.1.bb
diff --git a/recipes-security/selinux/selinux-initsh.inc b/recipes-security/selinux-scripts/selinux-initsh.inc
similarity index 100%
rename from recipes-security/selinux/selinux-initsh.inc
rename to recipes-security/selinux-scripts/selinux-initsh.inc
diff --git a/recipes-security/selinux/selinux-labeldev/selinux-labeldev.service b/recipes-security/selinux-scripts/selinux-labeldev/selinux-labeldev.service
similarity index 100%
rename from recipes-security/selinux/selinux-labeldev/selinux-labeldev.service
rename to recipes-security/selinux-scripts/selinux-labeldev/selinux-labeldev.service
diff --git a/recipes-security/selinux/selinux-labeldev/selinux-labeldev.sh b/recipes-security/selinux-scripts/selinux-labeldev/selinux-labeldev.sh
similarity index 100%
rename from recipes-security/selinux/selinux-labeldev/selinux-labeldev.sh
rename to recipes-security/selinux-scripts/selinux-labeldev/selinux-labeldev.sh
diff --git a/recipes-security/selinux/selinux-labeldev_0.1.bb b/recipes-security/selinux-scripts/selinux-labeldev_0.1.bb
similarity index 100%
rename from recipes-security/selinux/selinux-labeldev_0.1.bb
rename to recipes-security/selinux-scripts/selinux-labeldev_0.1.bb
--
2.25.1


[meta-selinux][PATCH 2/4] libselinux-python: inherit pkgconfig

Yi Zhao
 

Inherit pkgconfig to fix the build error which is introduced by
oe-commit:
commit 8e26252b45b7660c7c67c702411bdec187a76ffc
Author: Richard Purdie <richard.purdie@...>
Date: Sun Sep 19 16:17:31 2021 +0100

layer.conf: Extend recipes not to install without explict dependencies

Fixes:
make: pkg-config: Command not found
/usr/src/debug/libselinux/3.2-r0/git/libselinux/src/regex.c:399: undefined reference to `pcre_fullinfo'
/usr/src/debug/libselinux/3.3-r0/git/libselinux/src/regex.c:444: undefined reference to `pcre_free'
/usr/src/debug/libselinux/3.3-r0/git/libselinux/src/regex.c:456: undefined reference to `pcre_exec'

Signed-off-by: Yi Zhao <yi.zhao@...>
---
recipes-security/selinux/libselinux-python_3.2.bb | 2 +-
1 file changed, 1 insertion(+), 1 deletion(-)

diff --git a/recipes-security/selinux/libselinux-python_3.2.bb b/recipes-security/selinux/libselinux-python_3.2.bb
index f589ebd..136f538 100644
--- a/recipes-security/selinux/libselinux-python_3.2.bb
+++ b/recipes-security/selinux/libselinux-python_3.2.bb
@@ -8,7 +8,7 @@ LIC_FILES_CHKSUM = "file://${S}/LICENSE;md5=84b4d2c6ef954a2d4081e775a270d0d0"

require selinux_common.inc

-inherit python3native python3targetconfig
+inherit python3native python3targetconfig pkgconfig

FILESEXTRAPATHS:prepend := "${THISDIR}/libselinux:"
SRC_URI += "\
--
2.25.1


extra-cmake-modules-native-5.81.0 Package porting on riscv target using meta-qt5-extra layer #yocto

sateesh m
 

Hi Guys,

              I am facing compile-time issue (extra-cmake-modules-native-5.81.0 ). Using bitbake extra-cmake-modules it's compiled fine. It is dependent on other packages. Using bitbake extra-cmake-modules is compiled success. other dependent package expecting extra-cmake-modules-native.

build/tmp-glibc/work/x86_64-linux/extra-cmake-modules-native/5.81.0-r0/temp/run.do_compile.21147' failed with exit code 1:
build/tmp-glibc/work/x86_64-linux/extra-cmake-modules-native/5.81.0-r0/build/docs/html > build-html.log
FAILED: docs/doc_format_html 
Could not import extension ecm (exception: cannot import name 'htmlescape')

How can I fix this issue or build time it is going to docs so how I can disable it.  or any patch available gives some suggestions to fix this issue.


Thanks & Regards,
Sateesh





Regards,
Sateesh

2761 - 2780 of 57772