Re: #yocto #zeus Problem with moving from rocko to zeus #yocto #zeus

Dusan Radic <dusrad@...>

Here is the error:

| .../kernel-source/include/linux/log2.h:22:1: warning: ignoring
attribute 'noreturn' because it conflicts with attribute 'const'
| 22 | int ____ilog2_NaN(void);
| | ^~~
| /tmp/ccA2wTxM.s: Assembler messages:
| /tmp/ccA2wTxM.s:3486: Error: .err encountered
| /tmp/ccA2wTxM.s:3546: Error: .err encountered
| .../kernel-source/scripts/ recipe for target
'fs/fat/dir.o' failed
| make[4]: *** [fs/fat/dir.o] Error 1
| make[4]: *** Waiting for unfinished jobs....
| CC fs/cifs/smb2maperror.o
| In file included from .../kernel-source/include/linux/kernel.h:11,

However, now that I have switched to linux-imx-4.14.98 I made
significant progress.
It looks like it's going to work, I'll keep you posted.

Best regards,

On Thu, Feb 10, 2022 at 6:20 PM Khem Raj <raj.khem@...> wrote:

On 2/10/22 8:56 AM, Dusan Radic wrote:

I am trying to upgrade my distro from rocko to zeus.
After I fixed all the initial parsing and build problems I have
reached a point where the linux-imx doesn't build. Maybe I am
underestimating the task in front of me, but I have already seen it

The error looks like this:

| .../kernel-source/Makefile:947: recipe for target 'fs' failed
| make[2]: *** [fs] Error 2
| Makefile:146: recipe for target 'sub-make' failed
| make[1]: *** [sub-make] Error 2
| Makefile:24: recipe for target '__sub-make' failed
| make: *** [__sub-make] Error 2
| WARNING: exit code 1 from a shell command.
ERROR: Task (.../meta-mylayer/recipes-kernel/linux/
failed with exit code '1'

Is it possible that I am using the wrong linux-imx version? I have
tried a few but to no avail.
perhaps there is more specific compiler error in logs above that ?

Thanks in advance.

Best regards,

Join to automatically receive all group messages.