Re: curl_easy_perform() failed: Couldn't connect to server #yocto #linux


Vijay Rakesh Munganda
 

Hi Khem raj,

Regarding zbar, I found the video option was disabled in the .bb file, so I had changed it to --enable-video and ran the build, but the build failed at do_install. Do I Need to make change anything else? 

Log:
|  /home/bl-docker/rity/bsp/tmp/hosttools/mkdir -p '/home/bl-docker/rity/bsp/tmp/work/aarch64-poky-linux/zbar/0.10+gitAUTOINC+67003d2a98-r0/image/usr/bin'
|   ./aarch64-poky-linux-libtool   --mode=install /home/bl-docker/rity/bsp/tmp/hosttools/install -c zbarcam/zbarcam '/home/bl-docker/rity/bsp/tmp/work/aarch64-poky-linux/zbar/0.10+gitAUTOINC+67003d2a98-r0/image/usr/bin'
|  /home/bl-docker/rity/bsp/tmp/hosttools/install -c -m 644 ../git/doc/man/zbarcam.1 '/home/bl-docker/rity/bsp/tmp/work/aarch64-poky-linux/zbar/0.10+gitAUTOINC+67003d2a98-r0/image/usr/share/man/man1'
| /home/bl-docker/rity/bsp/tmp/hosttools/install: cannot stat '../git/doc/man/zbarcam.1': No such file or directory
| Makefile:2386: recipe for target 'install-man1' failed
| make[3]: *** [install-man1] Error 1
| make[3]: *** Waiting for unfinished jobs....
| aarch64-poky-linux-libtool: warning: 'zbar/libzbar.la' has not been installed in '/usr/lib'
| aarch64-poky-linux-libtool: install: /home/bl-docker/rity/bsp/tmp/hosttools/install -c zbarcam/.libs/zbarcam /home/bl-docker/rity/bsp/tmp/work/aarch64-poky-linux/zbar/0.10+gitAUTOINC+67003d2a98-r0/image/usr/bin/zbarcam
| make[3]: Leaving directory '/home/bl-docker/rity/bsp/tmp/work/aarch64-poky-linux/zbar/0.10+gitAUTOINC+67003d2a98-r0/build'
| Makefile:2850: recipe for target 'install-am' failed
| make[2]: *** [install-am] Error 2
| make[2]: Leaving directory '/home/bl-docker/rity/bsp/tmp/work/aarch64-poky-linux/zbar/0.10+gitAUTOINC+67003d2a98-r0/build'
| Makefile:2541: recipe for target 'install-recursive' failed
| make[1]: *** [install-recursive] Error 1
| make[1]: Leaving directory '/home/bl-docker/rity/bsp/tmp/work/aarch64-poky-linux/zbar/0.10+gitAUTOINC+67003d2a98-r0/build'
| Makefile:2844: recipe for target 'install' failed
| make: *** [install] Error 2
| WARNING: /home/bl-docker/rity/bsp/tmp/work/aarch64-poky-linux/zbar/0.10+gitAUTOINC+67003d2a98-r0/temp/run.do_install.15449:1 exit 1 from 'exit 1'

Thanks & Regards,
Vijay Rakesh.

Join yocto@lists.yoctoproject.org to automatically receive all group messages.