# yocto zeus -building a grub image


Monsees, Steven C (US)
 

 

Can someone provide an answer on how to correct the following grub build issue ?

 

I am attempting to build a grub image under zeus, and I am seeing the error output below…

 

It appears that `./grub-core/verify.*' –do not appear to have been built under the “./grub-core” build directory for zeus.

 

Under our “rocko” based build the verify.marker/verify.mod/verify.module are all present.

 

How do I generate the referenced modules ?

 

Thanks,

Steve

 

ERROR OUTPUT SEEN:

 

Initialising tasks: 100% |###########################################################################################| Time: 0:00:04

Sstate summary: Wanted 2127 Found 2096 Missed 31 Current 0 (98% match, 0% complete)

NOTE: Executing Tasks

NOTE: Setscene tasks completed

ERROR: grub-efi-2.04-r0 do_mkimage: Execution of '/disk0/scratch/smonsees/yocto/workspace_3/meta-bae/meta-limws/builds/sbcb-default/tmp/work/corei7-64-poky-linux/grub-efi/2.04-r0/temp/run.do_mkimage.7707' failed with exit code 1:

/disk0/scratch/smonsees/yocto/workspace_3/meta-bae/meta-limws/builds/cyberobjects/core /disk0/scratch/smonsees/yocto/workspace_3/meta-bae/meta-limws/builds/sbcb-default

/disk0/scratch/smonsees/yocto/workspace_3/meta-bae/meta-limws/builds/sbcb-default

grub-mkimage: error: cannot open `./grub-core/verify.mod': No such file or directory.

WARNING: /disk0/scratch/smonsees/yocto/workspace_3/meta-bae/meta-limws/builds/sbcb-default/tmp/work/corei7-64-poky-linux/grub-efi/2.04-r0/temp/run.do_mkimage.7707:1 exit 1 from 'grub-mkimage -c "/disk0/scratch/smonsees/yocto/workspace_3/meta-bae/meta-limws/builds/sbcb-default/tmp/work/corei7-64-poky-linux/grub-efi/2.04-r0/image/ofp/proc4-initial.cfg" -p /ofp -k "/disk0/scratch/smonsees/yocto/workspace_3/meta-bae/meta-limws/builds/cyberobjects/core/proc4.key" -d "./grub-core" -O "x86_64-efi" -C "auto" -o "/disk0/scratch/smonsees/yocto/workspace_3/meta-bae/meta-limws/builds/sbcb-default/tmp/work/corei7-64-poky-linux/grub-efi/2.04-r0/build/proc4.efi" configfile echo efinet gcry_rsa loopback password_pbkdf2 reboot sleep tftp verify boot linux ext2 fat serial part_msdos part_gpt normal efi_gop iso9660 configfile search loadenv test chain efivar mok2verify password_pbkdf2'

 

ERROR: Logfile of failure stored in: /disk0/scratch/smonsees/yocto/workspace_3/meta-bae/meta-limws/builds/sbcb-default/tmp/work/corei7-64-poky-linux/grub-efi/2.04-r0/temp/log.do_mkimage.7707

Log data follows:

| DEBUG: Executing shell function do_mkimage

| /disk0/scratch/smonsees/yocto/workspace_3/meta-bae/meta-limws/builds/cyberobjects/core /disk0/scratch/smonsees/yocto/workspace_3/meta-bae/meta-limws/builds/sbcb-default

| /disk0/scratch/smonsees/yocto/workspace_3/meta-bae/meta-limws/builds/sbcb-default

| grub-mkimage: error: cannot open `./grub-core/verify.mod': No such file or directory.

| WARNING: /disk0/scratch/smonsees/yocto/workspace_3/meta-bae/meta-limws/builds/sbcb-default/tmp/work/corei7-64-poky-linux/grub-efi/2.04-r0/temp/run.do_mkimage.7707:1 exit 1 from 'grub-mkimage -c "/disk0/scratch/smonsees/yocto/workspace_3/meta-bae/meta-limws/builds/sbcb-default/tmp/work/corei7-64-poky-linux/grub-efi/2.04-r0/image/ofp/proc4-initial.cfg" -p /ofp -k "/disk0/scratch/smonsees/yocto/workspace_3/meta-bae/meta-limws/builds/cyberobjects/core/proc4.key" -d "./grub-core" -O "x86_64-efi" -C "auto" -o "/disk0/scratch/smonsees/yocto/workspace_3/meta-bae/meta-limws/builds/sbcb-default/tmp/work/corei7-64-poky-linux/grub-efi/2.04-r0/build/proc4.efi" configfile echo efinet gcry_rsa loopback password_pbkdf2 reboot sleep tftp verify boot linux ext2 fat serial part_msdos part_gpt normal efi_gop iso9660 configfile search loadenv test chain efivar mok2verify password_pbkdf2'

| ERROR: Execution of '/disk0/scratch/smonsees/yocto/workspace_3/meta-bae/meta-limws/builds/sbcb-default/tmp/work/corei7-64-poky-linux/grub-efi/2.04-r0/temp/run.do_mkimage.7707' failed with exit code 1:

| /disk0/scratch/smonsees/yocto/workspace_3/meta-bae/meta-limws/builds/cyberobjects/core /disk0/scratch/smonsees/yocto/workspace_3/meta-bae/meta-limws/builds/sbcb-default

| /disk0/scratch/smonsees/yocto/workspace_3/meta-bae/meta-limws/builds/sbcb-default

| grub-mkimage: error: cannot open `./grub-core/verify.mod': No such file or directory.

| WARNING: /disk0/scratch/smonsees/yocto/workspace_3/meta-bae/meta-limws/builds/sbcb-default/tmp/work/corei7-64-poky-linux/grub-efi/2.04-r0/temp/run.do_mkimage.7707:1 exit 1 from 'grub-mkimage -c "/disk0/scratch/smonsees/yocto/workspace_3/meta-bae/meta-limws/builds/sbcb-default/tmp/work/corei7-64-poky-linux/grub-efi/2.04-r0/image/ofp/proc4-initial.cfg" -p /ofp -k "/disk0/scratch/smonsees/yocto/workspace_3/meta-bae/meta-limws/builds/cyberobjects/core/proc4.key" -d "./grub-core" -O "x86_64-efi" -C "auto" -o "/disk0/scratch/smonsees/yocto/workspace_3/meta-bae/meta-limws/builds/sbcb-default/tmp/work/corei7-64-poky-linux/grub-efi/2.04-r0/build/proc4.efi" configfile echo efinet gcry_rsa loopback password_pbkdf2 reboot sleep tftp verify boot linux ext2 fat serial part_msdos part_gpt normal efi_gop iso9660 configfile search loadenv test chain efivar mok2verify password_pbkdf2'

|

ERROR: Task (/disk0/scratch/smonsees/yocto/workspace_3/poky/meta/recipes-bsp/grub/grub-efi_2.04.bb:do_mkimage) failed with exit code '1'

NOTE: Tasks Summary: Attempted 5951 tasks of which 5421 didn't need to be rerun and 1 failed.

 

Summary: 1 task failed:

  /disk0/scratch/smonsees/yocto/workspace_3/poky/meta/recipes-bsp/grub/grub-efi_2.04.bb:do_mkimage

Summary: There was 1 WARNING message shown.

Summary: There was 1 ERROR message shown, returning a non-zero exit code.

 

Join yocto@lists.yoctoproject.org to automatically receive all group messages.