Build failures on yocto


Hector Oron <hector.oron@...>
 

#! /bin/sh

# Hello,

case $Debian_build_system in

lenny_amd64)
cat <<EOF
[...]
| /srv/build/builds/menuconfig2-test/build/rootfs/yocto/purple-3.2/build/tmp/work/x86_64-linux/qemu-native-0.10.2+git9eab386edbf8cf002a731f8204a156f243a47a57-r5/git/target-arm/dummygl.c:5:22:
warning: X11/Xlib.h: No such file or directory
| /srv/build/builds/menuconfig2-test/build/rootfs/yocto/purple-3.2/build/tmp/work/x86_64-linux/qemu-native-0.10.2+git9eab386edbf8cf002a731f8204a156f243a47a57-r5/git/target-arm/dummygl.c:6:23:
warning: X11/Xutil.h: No such file or directory
| /srv/build/builds/menuconfig2-test/build/rootfs/yocto/purple-3.2/build/tmp/work/x86_64-linux/qemu-native-0.10.2+git9eab386edbf8cf002a731f8204a156f243a47a57-r5/git/target-arm/dummygl.c:8:
error: expected ')' before '*' token
| /srv/build/builds/menuconfig2-test/build/rootfs/yocto/purple-3.2/build/tmp/work/x86_64-linux/qemu-native-0.10.2+git9eab386edbf8cf002a731f8204a156f243a47a57-r5/git/target-arm/dummygl.c:13:
warning: no previous prototype for 'opengl_process_enable'
| /srv/build/builds/menuconfig2-test/build/rootfs/yocto/purple-3.2/build/tmp/work/x86_64-linux/qemu-native-0.10.2+git9eab386edbf8cf002a731f8204a156f243a47a57-r5/git/target-arm/dummygl.c:19:
warning: no previous prototype for 'mem_opengl'
| make[1]: *** [dummygl.o] Error 1
| make[1]: Leaving directory
`/srv/build/builds/menuconfig2-test/build/rootfs/yocto/purple-3.2/build/tmp/work/x86_64-linux/qemu-native-0.10.2+git9eab386edbf8cf002a731f8204a156f243a47a57-r5/git/arm-linux-user'
| make: *** [subdir-arm-linux-user] Error 2
| FATAL: oe_runmake failed
NOTE: Task failed:
/srv/build/builds/menuconfig2-test/build/rootfs/yocto/purple-3.2/build/tmp/work/x86_64-linux/qemu-native-0.10.2+git9eab386edbf8cf002a731f8204a156f243a47a57-r5/temp/log.do_compile.28106
NOTE: package qemu-native-0.10.2+git9eab386edbf8cf002a731f8204a156f243a47a57-r5:
task do_compile: failed
ERROR: TaskFailed event exception, aborting
NOTE: package qemu-native-0.10.2+git9eab386edbf8cf002a731f8204a156f243a47a57:
failed
ERROR: Build of
/srv/build/builds/menuconfig2-test/build/rootfs/yocto/purple-3.2/meta/packages/qemu/qemu-native_git.bb
do_compile failed
ERROR: Task 597
(/srv/build/builds/menuconfig2-test/build/rootfs/yocto/purple-3.2/meta/packages/qemu/qemu-native_git.bb,
do_compile) failed
NOTE: Tasks Summary: Attempted 229 tasks of which 0 didn't need to be
rerun and 1 failed.
ERROR: '/srv/build/builds/menuconfig2-test/build/rootfs/yocto/purple-3.2/meta/packages/qemu/qemu-native_git.bb'
failed
NOTE: build 201011011610: completed
make: *** [/srv/build/builds/menuconfig2-test/build/rootfs/yocto/purple-3.2/foo]
Error 1
EOF
;;
lenny_i386)
cat <<EOF
[...]
| NOTE: Running
/srv/build/builds/build/rootfs/yocto/purple-3.2/build/tmp/work/x86_64-linux/gmp-native-4.2.4-r0/gmp-4.2.4/configure
--build=x86_64-linux --host=x86_64-linux
--target=x86_64-linux
--prefix=/srv/build/builds/build/rootfs/yocto/purple-3.2/build/tmp/staging/x86_64-linux/usr
--exec_prefix=/srv/build/builds/build/rootfs/yocto/purple-3.2/build/tmp/staging/x86_64-linux/usr

--bindir=/srv/build/builds/build/rootfs/yocto/purple-3.2/build/tmp/staging/x86_64-linux/usr/bin
--sbindir=/srv/build/builds/build/rootfs/yocto/purple-3.2/build/tmp/staging/x86_64-linux/usr/sbin

--libexecdir=/srv/build/builds/build/rootfs/yocto/purple-3.2/build/tmp/staging/x86_64-linux/usr/libexec

--datadir=/srv/build/builds/build/rootfs/yocto/purple-3.2/build/tmp/staging/x86_64-linux/usr/share
--sysconfdir=/srv/build/builds/build/rootfs/yocto/purple-3.2/build/tmp/staging/x86_64-linux/etc
--sharedstatedir=/srv/build/builds/build/rootfs/yocto/purple-3.2/build/tmp/staging/x86_64-linux/com
--localstatedir=/srv/build/builds/build/rootfs/yocto/purple-3.2/build/tmp/staging/x86_64-linux/var
--libdir=/srv/build/builds/build/rootfs/yocto/purple-3.2/build/tmp/staging/x86_64-linux/usr/lib

--includedir=/srv/build/builds/build/rootfs/yocto/purple-3.2/build/tmp/staging/x86_64-linux/usr/include

--oldincludedir=/srv/build/builds/build/rootfs/yocto/purple-3.2/build/tmp/staging/x86_64-linux/usr/include
--infodir=/srv/build/builds/build/rootfs/yocto/purple-3.2/build/tmp/staging/x86_64-linux/usr/share/info
--mandir=/srv/build/builds/build/rootfs/yocto/purple-3.2/build/tmp/staging/x86_64-linux/usr/share/man
...
| checking build system type... x86_64-pc-linux-gnu
| checking host system type... x86_64-pc-linux-gnu
| checking for a BSD-compatible install... /usr/bin/install -c
[...]
| checking size of unsigned short... 2
| checking for unsigned... yes
| checking size of unsigned... 4
| checking for unsigned long... yes
| checking size of unsigned long... 4
| checking for mp_limb_t... yes
| checking size of mp_limb_t... 4
| configure: error: Oops, mp_limb_t is 32 bits, but the assembler code
| in this configuration expects 64 bits.
| You appear to have set $CFLAGS, perhaps you also need to tell GMP the
| intended ABI, see "ABI and ISA" in the manual.
| FATAL: oe_runconf failed
NOTE: Task failed:
/srv/build/builds/build/rootfs/yocto/purple-3.2/build/tmp/work/x86_64-linux/gmp-native-4.2.4-r0/temp/log.do_configure.28892
NOTE: package gmp-native-4.2.4-r0: task do_configure: failed
ERROR: TaskFailed event exception, aborting
NOTE: package gmp-native-4.2.4: failed
ERROR: Build of
/srv/build/builds/build/rootfs/yocto/purple-3.2/meta/packages/gmp/gmp-native_4.2.4.bb
do_configure failed
ERROR: Task 556
(/srv/build/builds/build/rootfs/yocto/purple-3.2/meta/packages/gmp/gmp-native_4.2.4.bb,
do_configure) failed
NOTE: Tasks Summary: Attempted 135 tasks of which 135 didn't need to
be rerun and 1 failed.
ERROR: '/srv/build/builds/build/rootfs/yocto/purple-3.2/meta/packages/gmp/gmp-native_4.2.4.bb'
failed
NOTE: build 201011011717: completed
make: *** [/srv/build/builds/menuconfig2-i386/../build/rootfs/yocto/purple-3.2/foo]
Error 1
EOF
;;
unstable_amd64)
cat <<EOF
Still building......
EOF
;;
unstable_i386)
cat <<EOF
[...]
| checking size of unsigned long... 4
| checking size of mp_limb_t... 4
| configure: error: Oops, mp_limb_t is 32 bits, but the assembler code
| in this configuration expects 64 bits.
| You appear to have set $CFLAGS, perhaps you also need to tell GMP the
| intended ABI, see "ABI and ISA" in the manual.
| FATAL: oe_runconf failed
| ERROR: Task failed: ('function do_configure failed',
'/srv/build/builds/build/rootfs/yocto/laverne-4.0/build/tmp/work/x86_64-linux/gmp-native-5.0.1-r0/temp/log.do_configure.13641')
NOTE: package gmp-native-5.0.1-r0: task do_configure: Failed
ERROR: Task 971
(virtual:native:/srv/build/builds/build/rootfs/yocto/laverne-4.0/meta/recipes-support/gmp/gmp_5.0.1.bb,
do_configure) failed with 1
Waiting for 1 active tasks to finish:
1: gettext-native-0.17-r5 do_compile (pid 13646)
NOTE: package gettext-native-0.17-r5: task do_compile: Succeeded
ERROR: 'virtual:native:/srv/build/builds/build/rootfs/yocto/laverne-4.0/meta/recipes-support/gmp/gmp_5.0.1.bb'
failed
make: *** [/srv/build/builds/menuconfig2-i386/../build/rootfs/yocto/laverne-4.0/foo]
Error 1
EOF
;;
others|*)
cat <<EOF
- I need to setup "vm.mmap_min_addr = 0" under /etc/sysctl.conf
- sh linked to dash makes build system fail
(./build/rootfs/yocto/laverne-4.0/poky-init-build-env):
(sid_i386)zumbi@enorme:/srv/build/builds/build/rootfs/yocto/laverne-4.0$
checkbashisms poky-init-build-env
possible bashism in poky-init-build-env line 24 ($BASH_SOMETHING):
elif test x"$BASH_SOURCE" = x; then
possible bashism in poky-init-build-env line 27 ($BASH_SOMETHING):
. `dirname $BASH_SOURCE`/scripts/poky-env-internal
- On lenny python 2.5 required, so Purple 3.2 was built (Laverne
was not tried)
- On unstable Laverne 4.0 was attempted
EOF
;;
esac

echo "Have a nice day!"

-- System Information:
Debian Release: squeeze/sid
APT prefers unstable
APT policy: (700, 'unstable'), (600, 'testing'), (500, 'stable'),
(1, 'experimental')
Architecture: amd64 (x86_64)

Kernel: Linux 2.6.32-5-amd64 (SMP w/8 CPU cores)
Locale: LANG=en_GB.UTF-8, LC_CTYPE=en_GB.UTF-8 (charmap=UTF-8)
Shell: /bin/sh linked to /bin/bash
# ^^^^^----- I had to change it so I could build on unstable ;-)

--
 Héctor Orón

"Our Sun unleashes tremendous flares expelling hot gas into the Solar
System, which one day will disconnect us."

-- Day DVB-T stop working nicely
Video flare: http://antwrp.gsfc.nasa.gov/apod/ap100510.html

Join yocto@lists.yoctoproject.org to automatically receive all group messages.