centos8 failure summary


Richard Purdie
 

Hi,

I tried to summarise all of the "/tmp" file issues we've seen. We have 4 of
them, 3 on centos8-ty-2 and one on centos8-ty-1. Issues seen once in python
code, twice in kernel modules in the assembler and once in automake over an m4
file.

No idea what is going on :(

Cheers,

Richard


centos8-ty-1 oe-selftest pseudo.Pseudo.test_pseudo_pyc_creation

https://autobuilder.yoctoproject.org/typhoon/#/builders/79/builds/2644/steps/14/logs/stdio

NOTE: Running task 7 of 8 (/tmp/devtoolqa7t333xgr/core-copy/meta/recipes-devtools/cdrtools/cdrtools-native_3.01.bb:do_install)
ERROR: Traceback (most recent call last):
File "/home/pokybuild/yocto-worker/oe-selftest-centos/build/bitbake/bin/bitbake-worker", line 253, in child
the_data = bb_cache.loadDataFull(fn, appends)
File "/home/pokybuild/yocto-worker/oe-selftest-centos/build/bitbake/lib/bb/cache.py", line 332, in loadDataFull
bb_data = self.load_bbfile(virtualfn, appends, virtonly=True)
File "/home/pokybuild/yocto-worker/oe-selftest-centos/build/bitbake/lib/bb/cache.py", line 345, in load_bbfile
datastores = parse_recipe(bb_data, bbfile, appends, mc)
File "/home/pokybuild/yocto-worker/oe-selftest-centos/build/bitbake/lib/bb/cache.py", line 308, in parse_recipe
bb_data = bb.parse.handle(bbfile, bb_data)
File "/home/pokybuild/yocto-worker/oe-selftest-centos/build/bitbake/lib/bb/parse/__init__.py", line 107, in handle
return h['handle'](fn, data, include)
File "/home/pokybuild/yocto-worker/oe-selftest-centos/build/bitbake/lib/bb/parse/parse_py/BBHandler.py", line 114, in handle
abs_fn = resolve_file(fn, d)
File "/home/pokybuild/yocto-worker/oe-selftest-centos/build/bitbake/lib/bb/parse/__init__.py", line 131, in resolve_file
raise IOError(errno.ENOENT, "file %s not found" % fn)
FileNotFoundError: [Errno 2] file /tmp/devtoolqa7t333xgr/core-copy/meta/recipes-devtools/cdrtools/cdrtools-native_3.01.bb not found
ERROR: Task (/tmp/devtoolqa7t333xgr/core-copy/meta/recipes-devtools/cdrtools/cdrtools-native_3.01.bb:do_install) failed with exit code '1'

centos8-ty-2 reproducible-centos

https://autobuilder.yoctoproject.org/typhoon/#/builders/115/builds/766

/home/pokybuild/yocto-worker/reproducible-centos/build/meta/recipes-kernel/linux/linux-yocto_5.14.bb:do_compile_kernelmodules
/home/pokybuild/yocto-worker/reproducible-centos/build/meta/recipes-core/dbus/dbus_1.12.20.bb:do_configure

| CC [M] fs/nls/nls_cp737.o
| Assembler messages:
| Error: can't open /tmp/ccUONJmc.s for reading: No such file or directory
| make[3]: *** [/home/pokybuild/yocto-worker/reproducible-centos/build/build-st/reproducibleA/tmp/work-shared/qemux86-64/kernel-source/scripts/Makefile.build:271: fs/nls/nls_cp737.o] Error 1

| autoreconf: running: /home/pokybuild/yocto-worker/reproducible-centos/build/build-st/reproducibleA/tmp/work/core2-64-poky-linux/dbus/1.12.20-r0/recipe-sysroot-native/usr/bin/autoconf --include=/home/pokybuild/yocto-worker/reproducible-centos/build/build-st/reproducibleA/tmp/work/core2-64-poky-linux/dbus/1.12.20-r0/dbus-1.12.20/m4/ --include=/home/pokybuild/yocto-worker/reproducible-centos/build/build-st/reproducibleA/tmp/work/core2-64-poky-linux/dbus/1.12.20-r0/recipe-sysroot-native/usr/share/aclocal/ --force
| autom4te: error: cannot open /tmp/arGZ1Myy/am4tld4nPo/traces.m4: No such file or directory
| autoreconf: error: /home/pokybuild/yocto-worker/reproducible-centos/build/build-st/reproducibleA/tmp/work/core2-64-poky-linux/dbus/1.12.20-r0/recipe-sysroot-native/usr/bin/autoconf failed with exit status: 1

musl-qemux86 centos8-ty-2

https://autobuilder.yoctoproject.org/typhoon/#/builders/64/builds/4099/steps/11/logs/stdio

| Assembler messages:
| Error: can't open /tmp/ccQzs5nT.s for reading: No such file or directory
| make[3]: *** [/home/pokybuild/yocto-worker/musl-qemux86/build/build/tmp/work-shared/qemux86/kernel-source/scripts/Makefile.build:271: drivers/net/tun.o] Error 1

Join swat@lists.yoctoproject.org to automatically receive all group messages.