i.MX6 screen rotation


Andy Pont
 

Hello,

I’m not sure whether this is a hardware issue, Linux kernel issue or a Yocto issue but as some of the finest minds are on the mailing lists I figured it was a good place to start! Enough flattery? :-)

We are using a Boundary Devices Nitrogen6X Lite (i.MX6S) board as a demo platform for a project using the linux-boundary 4.14.98 kernel.   The Boundary Devices kernel is more-or-less the same as the Freescale kernel imx_4.14.x_2.0.0_ga.

I am trying to get framebuffer rotation to work so that I can rotate the framebuffer console (on fb0) through 90 degrees.  I have the kernel configuration option CONFIG_FRAMEBUFFER_CONSOLE_ROTATION enabled and am trying to run some tests by setting values through /sys/class/graphics/fb0/rotate and /sys/class/graphics/fbcon/rotate.

I have used fb-test to display an image onto the screen and if I write “1” to /sys/class/graphics/fb0/rotate then the display flips and looks great when viewed in a mirror.  No amount of trying to set other values will rotate the screen through 90 or 270 degrees.

Is there an issue with rotation on the i.MX6 or is there a configuration setting that I am missing somewhere?

-Andy.


Mattis Spieler Asp
 

Uname -a
Linux purple 5.0.4-050004-generic #201903231634 SMP Sat Mar 23 20:37:29 UTC 2019 x86_64 x86_64 x86_64 GNU/Linux

Also


mattis@purple:~/development/main/Unishop/template-2$ lsb_release -a
No LSB modules are available.
Distributor ID: Ubuntu
Description: Ubuntu 18.04.2 LTS
Release: 18.04
Codename: bionic


Here is me running rebuild
mattis@purple:~/development/main/Unishop/template-2$ sudo npm rebuild node-sass
[sudo] password for mattis:

> node-sass@4.11.0 install /home/mattis/development/main/Unishop/template-2/node_modules/node-sass
> node scripts/install.js

Downloading binary from https://github.com/sass/node-sass/releases/download/v4.11.0/linux-x64-72_binding.node
Cannot download "https://github.com/sass/node-sass/releases/download/v4.11.0/linux-x64-72_binding.node":

HTTP error 404 Not Found

Hint: If github.com is not accessible in your location
      try setting a proxy via HTTP_PROXY, e.g.

      export HTTP_PROXY=http://example.com:1234

or configure npm proxy via

      npm config set proxy http://example.com:8080

> node-sass@4.11.0 postinstall /home/mattis/development/main/Unishop/template-2/node_modules/node-sass
> node scripts/build.js

Building: /usr/local/bin/node /home/mattis/development/main/Unishop/template-2/node_modules/node-gyp/bin/node-gyp.js rebuild --verbose --libsass_ext= --libsass_cflags= --libsass_ldflags= --libsass_library=
gyp info it worked if it ends with ok
gyp verb cli [
gyp verb cli   '/usr/local/bin/node',
gyp verb cli   '/home/mattis/development/main/Unishop/template-2/node_modules/node-gyp/bin/node-gyp.js',
gyp verb cli   'rebuild',
gyp verb cli   '--verbose',
gyp verb cli   '--libsass_ext=',
gyp verb cli   '--libsass_cflags=',
gyp verb cli   '--libsass_ldflags=',
gyp verb cli   '--libsass_library='
gyp verb cli ]
gyp info using node-gyp@3.8.0
gyp info using node@... | linux | x64
gyp verb command rebuild []
gyp verb command clean []
gyp verb clean removing "build" directory
gyp verb command configure []
gyp verb check python checking for Python executable "python2" in the PATH
gyp verb `which` succeeded python2 /usr/bin/python2
gyp verb check python version `/usr/bin/python2 -c "import sys; print "2.7.17
gyp verb check python version .%s.%s" % sys.version_info[:3];"` returned: %j
gyp verb get node dir no --target version specified, falling back to host node version: 12.14.1
gyp verb command install [ '12.14.1' ]
gyp verb install input version string "12.14.1"
gyp verb install installing version: 12.14.1
gyp verb install --ensure was passed, so won't reinstall if already installed
gyp verb install version is already installed, need to check "installVersion"
gyp verb got "installVersion" 9
gyp verb needs "installVersion" 9
gyp verb install version is good
gyp verb get node dir target node version installed: 12.14.1
gyp verb build dir attempting to create "build" dir: /home/mattis/development/main/Unishop/template-2/node_modules/node-sass/build
gyp verb build dir "build" dir needed to be created? /home/mattis/development/main/Unishop/template-2/node_modules/node-sass/build
gyp verb build/config.gypi creating config file
gyp verb build/config.gypi writing out config file: /home/mattis/development/main/Unishop/template-2/node_modules/node-sass/build/config.gypi
gyp verb config.gypi checking for gypi file: /home/mattis/development/main/Unishop/template-2/node_modules/node-sass/config.gypi
gyp verb common.gypi checking for gypi file: /home/mattis/development/main/Unishop/template-2/node_modules/node-sass/common.gypi
gyp verb gyp gyp format was not specified; forcing "make"
gyp info spawn /usr/bin/python2
gyp info spawn args [
gyp info spawn args   '/home/mattis/development/main/Unishop/template-2/node_modules/node-gyp/gyp/gyp_main.py',
gyp info spawn args   'binding.gyp',
gyp info spawn args   '-f',
gyp info spawn args   'make',
gyp info spawn args   '-I',
gyp info spawn args   '/home/mattis/development/main/Unishop/template-2/node_modules/node-sass/build/config.gypi',
gyp info spawn args   '-I',
gyp info spawn args   '/home/mattis/development/main/Unishop/template-2/node_modules/node-gyp/addon.gypi',
gyp info spawn args   '-I',
gyp info spawn args   '/home/mattis/.node-gyp/12.14.1/include/node/common.gypi',
gyp info spawn args   '-Dlibrary=shared_library',
gyp info spawn args   '-Dvisibility=default',
gyp info spawn args   '-Dnode_root_dir=/home/mattis/.node-gyp/12.14.1',
gyp info spawn args   '-Dnode_gyp_dir=/home/mattis/development/main/Unishop/template-2/node_modules/node-gyp',
gyp info spawn args   '-Dnode_lib_file=/home/mattis/.node-gyp/12.14.1/<(target_arch)/node.lib',
gyp info spawn args   '-Dmodule_root_dir=/home/mattis/development/main/Unishop/template-2/node_modules/node-sass',
gyp info spawn args   '-Dnode_engine=v8',
gyp info spawn args   '--depth=.',
gyp info spawn args   '--no-parallel',
gyp info spawn args   '--generator-output',
gyp info spawn args   'build',
gyp info spawn args   '-Goutput_dir=.'
gyp info spawn args ]
gyp verb command build []
gyp verb build type Release
gyp verb architecture x64
gyp verb node dev dir /home/mattis/.node-gyp/12.14.1
gyp verb `which` succeeded for `make` /usr/bin/make
gyp info spawn make
gyp info spawn args [ 'V=1', 'BUILDTYPE=Release', '-C', 'build' ]
make: Entering directory '/home/mattis/development/main/Unishop/template-2/node_modules/node-sass/build'
  g++ '-DNODE_GYP_MODULE_NAME=libsass' '-DUSING_UV_SHARED=1' '-DUSING_V8_SHARED=1' '-DV8_DEPRECATION_WARNINGS=1' '-DV8_DEPRECATION_WARNINGS' '-DV8_IMMINENT_DEPRECATION_WARNINGS' '-D_LARGEFILE_SOURCE' '-D_FILE_OFFSET_BITS=64' '-DOPENSSL_NO_PINSHARED' '-DOPENSSL_THREADS' '-DLIBSASS_VERSION="3.5.4"' -I/home/mattis/.node-gyp/12.14.1/include/node -I/home/mattis/.node-gyp/12.14.1/src -I/home/mattis/.node-gyp/12.14.1/deps/openssl/config -I/home/mattis/.node-gyp/12.14.1/deps/openssl/openssl/include -I/home/mattis/.node-gyp/12.14.1/deps/uv/include -I/home/mattis/.node-gyp/12.14.1/deps/zlib -I/home/mattis/.node-gyp/12.14.1/deps/v8/include -I../src/libsass/include  -fPIC -pthread -Wall -Wextra -Wno-unused-parameter -m64 -O3 -fno-omit-frame-pointer -std=gnu++1y -std=c++0x -fexceptions -frtti -MMD -MF ./Release/.deps/Release/obj.target/libsass/src/libsass/src/ast.o.d.raw   -c -o Release/obj.target/libsass/src/libsass/src/ast.o ../src/libsass/src/ast.cpp
  g++ '-DNODE_GYP_MODULE_NAME=libsass' '-DUSING_UV_SHARED=1' '-DUSING_V8_SHARED=1' '-DV8_DEPRECATION_WARNINGS=1' '-DV8_DEPRECATION_WARNINGS' '-DV8_IMMINENT_DEPRECATION_WARNINGS' '-D_LARGEFILE_SOURCE' '-D_FILE_OFFSET_BITS=64' '-DOPENSSL_NO_PINSHARED' '-DOPENSSL_THREADS' '-DLIBSASS_VERSION="3.5.4"' -I/home/mattis/.node-gyp/12.14.1/include/node -I/home/mattis/.node-gyp/12.14.1/src -I/home/mattis/.node-gyp/12.14.1/deps/openssl/config -I/home/mattis/.node-gyp/12.14.1/deps/openssl/openssl/include -I/home/mattis/.node-gyp/12.14.1/deps/uv/include -I/home/mattis/.node-gyp/12.14.1/deps/zlib -I/home/mattis/.node-gyp/12.14.1/deps/v8/include -I../src/libsass/include  -fPIC -pthread -Wall -Wextra -Wno-unused-parameter -m64 -O3 -fno-omit-frame-pointer -std=gnu++1y -std=c++0x -fexceptions -frtti -MMD -MF ./Release/.deps/Release/obj.target/libsass/src/libsass/src/ast_fwd_decl.o.d.raw   -c -o Release/obj.target/libsass/src/libsass/src/ast_fwd_decl.o ../src/libsass/src/ast_fwd_decl.cpp
  g++ '-DNODE_GYP_MODULE_NAME=libsass' '-DUSING_UV_SHARED=1' '-DUSING_V8_SHARED=1' '-DV8_DEPRECATION_WARNINGS=1' '-DV8_DEPRECATION_WARNINGS' '-DV8_IMMINENT_DEPRECATION_WARNINGS' '-D_LARGEFILE_SOURCE' '-D_FILE_OFFSET_BITS=64' '-DOPENSSL_NO_PINSHARED' '-DOPENSSL_THREADS' '-DLIBSASS_VERSION="3.5.4"' -I/home/mattis/.node-gyp/12.14.1/include/node -I/home/mattis/.node-gyp/12.14.1/src -I/home/mattis/.node-gyp/12.14.1/deps/openssl/config -I/home/mattis/.node-gyp/12.14.1/deps/openssl/openssl/include -I/home/mattis/.node-gyp/12.14.1/deps/uv/include -I/home/mattis/.node-gyp/12.14.1/deps/zlib -I/home/mattis/.node-gyp/12.14.1/deps/v8/include -I../src/libsass/include  -fPIC -pthread -Wall -Wextra -Wno-unused-parameter -m64 -O3 -fno-omit-frame-pointer -std=gnu++1y -std=c++0x -fexceptions -frtti -MMD -MF ./Release/.deps/Release/obj.target/libsass/src/libsass/src/backtrace.o.d.raw   -c -o Release/obj.target/libsass/src/libsass/src/backtrace.o ../src/libsass/src/backtrace.cpp
  g++ '-DNODE_GYP_MODULE_NAME=libsass' '-DUSING_UV_SHARED=1' '-DUSING_V8_SHARED=1' '-DV8_DEPRECATION_WARNINGS=1' '-DV8_DEPRECATION_WARNINGS' '-DV8_IMMINENT_DEPRECATION_WARNINGS' '-D_LARGEFILE_SOURCE' '-D_FILE_OFFSET_BITS=64' '-DOPENSSL_NO_PINSHARED' '-DOPENSSL_THREADS' '-DLIBSASS_VERSION="3.5.4"' -I/home/mattis/.node-gyp/12.14.1/include/node -I/home/mattis/.node-gyp/12.14.1/src -I/home/mattis/.node-gyp/12.14.1/deps/openssl/config -I/home/mattis/.node-gyp/12.14.1/deps/openssl/openssl/include -I/home/mattis/.node-gyp/12.14.1/deps/uv/include -I/home/mattis/.node-gyp/12.14.1/deps/zlib -I/home/mattis/.node-gyp/12.14.1/deps/v8/include -I../src/libsass/include  -fPIC -pthread -Wall -Wextra -Wno-unused-parameter -m64 -O3 -fno-omit-frame-pointer -std=gnu++1y -std=c++0x -fexceptions -frtti -MMD -MF ./Release/.deps/Release/obj.target/libsass/src/libsass/src/base64vlq.o.d.raw   -c -o Release/obj.target/libsass/src/libsass/src/base64vlq.o ../src/libsass/src/base64vlq.cpp
  g++ '-DNODE_GYP_MODULE_NAME=libsass' '-DUSING_UV_SHARED=1' '-DUSING_V8_SHARED=1' '-DV8_DEPRECATION_WARNINGS=1' '-DV8_DEPRECATION_WARNINGS' '-DV8_IMMINENT_DEPRECATION_WARNINGS' '-D_LARGEFILE_SOURCE' '-D_FILE_OFFSET_BITS=64' '-DOPENSSL_NO_PINSHARED' '-DOPENSSL_THREADS' '-DLIBSASS_VERSION="3.5.4"' -I/home/mattis/.node-gyp/12.14.1/include/node -I/home/mattis/.node-gyp/12.14.1/src -I/home/mattis/.node-gyp/12.14.1/deps/openssl/config -I/home/mattis/.node-gyp/12.14.1/deps/openssl/openssl/include -I/home/mattis/.node-gyp/12.14.1/deps/uv/include -I/home/mattis/.node-gyp/12.14.1/deps/zlib -I/home/mattis/.node-gyp/12.14.1/deps/v8/include -I../src/libsass/include  -fPIC -pthread -Wall -Wextra -Wno-unused-parameter -m64 -O3 -fno-omit-frame-pointer -std=gnu++1y -std=c++0x -fexceptions -frtti -MMD -MF ./Release/.deps/Release/obj.target/libsass/src/libsass/src/bind.o.d.raw   -c -o Release/obj.target/libsass/src/libsass/src/bind.o ../src/libsass/src/bind.cpp
  cc '-DNODE_GYP_MODULE_NAME=libsass' '-DUSING_UV_SHARED=1' '-DUSING_V8_SHARED=1' '-DV8_DEPRECATION_WARNINGS=1' '-DV8_DEPRECATION_WARNINGS' '-DV8_IMMINENT_DEPRECATION_WARNINGS' '-D_LARGEFILE_SOURCE' '-D_FILE_OFFSET_BITS=64' '-DOPENSSL_NO_PINSHARED' '-DOPENSSL_THREADS' '-DLIBSASS_VERSION="3.5.4"' -I/home/mattis/.node-gyp/12.14.1/include/node -I/home/mattis/.node-gyp/12.14.1/src -I/home/mattis/.node-gyp/12.14.1/deps/openssl/config -I/home/mattis/.node-gyp/12.14.1/deps/openssl/openssl/include -I/home/mattis/.node-gyp/12.14.1/deps/uv/include -I/home/mattis/.node-gyp/12.14.1/deps/zlib -I/home/mattis/.node-gyp/12.14.1/deps/v8/include -I../src/libsass/include  -fPIC -pthread -Wall -Wextra -Wno-unused-parameter -m64 -O3 -fno-omit-frame-pointer  -MMD -MF ./Release/.deps/Release/obj.target/libsass/src/libsass/src/cencode.o.d.raw   -c -o Release/obj.target/libsass/src/libsass/src/cencode.o ../src/libsass/src/cencode.c
../src/libsass/src/cencode.c: In function ‘base64_encode_block’:
../src/libsass/src/cencode.c:48:11: warning: this statement may fall through [-Wimplicit-fallthrough=]
    result = (fragment & 0x003) << 4;
    ~~~~~~~^~~~~~~~~~~~~~~~~~~~~~~~~
../src/libsass/src/cencode.c:52:2: note: here
  case step_B:
  ^~~~
../src/libsass/src/cencode.c:62:11: warning: this statement may fall through [-Wimplicit-fallthrough=]
    result = (fragment & 0x00f) << 2;
    ~~~~~~~^~~~~~~~~~~~~~~~~~~~~~~~~
../src/libsass/src/cencode.c:66:2: note: here
  case step_C:
  ^~~~
  g++ '-DNODE_GYP_MODULE_NAME=libsass' '-DUSING_UV_SHARED=1' '-DUSING_V8_SHARED=1' '-DV8_DEPRECATION_WARNINGS=1' '-DV8_DEPRECATION_WARNINGS' '-DV8_IMMINENT_DEPRECATION_WARNINGS' '-D_LARGEFILE_SOURCE' '-D_FILE_OFFSET_BITS=64' '-DOPENSSL_NO_PINSHARED' '-DOPENSSL_THREADS' '-DLIBSASS_VERSION="3.5.4"' -I/home/mattis/.node-gyp/12.14.1/include/node -I/home/mattis/.node-gyp/12.14.1/src -I/home/mattis/.node-gyp/12.14.1/deps/openssl/config -I/home/mattis/.node-gyp/12.14.1/deps/openssl/openssl/include -I/home/mattis/.node-gyp/12.14.1/deps/uv/include -I/home/mattis/.node-gyp/12.14.1/deps/zlib -I/home/mattis/.node-gyp/12.14.1/deps/v8/include -I../src/libsass/include  -fPIC -pthread -Wall -Wextra -Wno-unused-parameter -m64 -O3 -fno-omit-frame-pointer -std=gnu++1y -std=c++0x -fexceptions -frtti -MMD -MF ./Release/.deps/Release/obj.target/libsass/src/libsass/src/check_nesting.o.d.raw   -c -o Release/obj.target/libsass/src/libsass/src/check_nesting.o ../src/libsass/src/check_nesting.cpp
  g++ '-DNODE_GYP_MODULE_NAME=libsass' '-DUSING_UV_SHARED=1' '-DUSING_V8_SHARED=1' '-DV8_DEPRECATION_WARNINGS=1' '-DV8_DEPRECATION_WARNINGS' '-DV8_IMMINENT_DEPRECATION_WARNINGS' '-D_LARGEFILE_SOURCE' '-D_FILE_OFFSET_BITS=64' '-DOPENSSL_NO_PINSHARED' '-DOPENSSL_THREADS' '-DLIBSASS_VERSION="3.5.4"' -I/home/mattis/.node-gyp/12.14.1/include/node -I/home/mattis/.node-gyp/12.14.1/src -I/home/mattis/.node-gyp/12.14.1/deps/openssl/config -I/home/mattis/.node-gyp/12.14.1/deps/openssl/openssl/include -I/home/mattis/.node-gyp/12.14.1/deps/uv/include -I/home/mattis/.node-gyp/12.14.1/deps/zlib -I/home/mattis/.node-gyp/12.14.1/deps/v8/include -I../src/libsass/include  -fPIC -pthread -Wall -Wextra -Wno-unused-parameter -m64 -O3 -fno-omit-frame-pointer -std=gnu++1y -std=c++0x -fexceptions -frtti -MMD -MF ./Release/.deps/Release/obj.target/libsass/src/libsass/src/color_maps.o.d.raw   -c -o Release/obj.target/libsass/src/libsass/src/color_maps.o ../src/libsass/src/color_maps.cpp
  g++ '-DNODE_GYP_MODULE_NAME=libsass' '-DUSING_UV_SHARED=1' '-DUSING_V8_SHARED=1' '-DV8_DEPRECATION_WARNINGS=1' '-DV8_DEPRECATION_WARNINGS' '-DV8_IMMINENT_DEPRECATION_WARNINGS' '-D_LARGEFILE_SOURCE' '-D_FILE_OFFSET_BITS=64' '-DOPENSSL_NO_PINSHARED' '-DOPENSSL_THREADS' '-DLIBSASS_VERSION="3.5.4"' -I/home/mattis/.node-gyp/12.14.1/include/node -I/home/mattis/.node-gyp/12.14.1/src -I/home/mattis/.node-gyp/12.14.1/deps/openssl/config -I/home/mattis/.node-gyp/12.14.1/deps/openssl/openssl/include -I/home/mattis/.node-gyp/12.14.1/deps/uv/include -I/home/mattis/.node-gyp/12.14.1/deps/zlib -I/home/mattis/.node-gyp/12.14.1/deps/v8/include -I../src/libsass/include  -fPIC -pthread -Wall -Wextra -Wno-unused-parameter -m64 -O3 -fno-omit-frame-pointer -std=gnu++1y -std=c++0x -fexceptions -frtti -MMD -MF ./Release/.deps/Release/obj.target/libsass/src/libsass/src/constants.o.d.raw   -c -o Release/obj.target/libsass/src/libsass/src/constants.o ../src/libsass/src/constants.cpp
  g++ '-DNODE_GYP_MODULE_NAME=libsass' '-DUSING_UV_SHARED=1' '-DUSING_V8_SHARED=1' '-DV8_DEPRECATION_WARNINGS=1' '-DV8_DEPRECATION_WARNINGS' '-DV8_IMMINENT_DEPRECATION_WARNINGS' '-D_LARGEFILE_SOURCE' '-D_FILE_OFFSET_BITS=64' '-DOPENSSL_NO_PINSHARED' '-DOPENSSL_THREADS' '-DLIBSASS_VERSION="3.5.4"' -I/home/mattis/.node-gyp/12.14.1/include/node -I/home/mattis/.node-gyp/12.14.1/src -I/home/mattis/.node-gyp/12.14.1/deps/openssl/config -I/home/mattis/.node-gyp/12.14.1/deps/openssl/openssl/include -I/home/mattis/.node-gyp/12.14.1/deps/uv/include -I/home/mattis/.node-gyp/12.14.1/deps/zlib -I/home/mattis/.node-gyp/12.14.1/deps/v8/include -I../src/libsass/include  -fPIC -pthread -Wall -Wextra -Wno-unused-parameter -m64 -O3 -fno-omit-frame-pointer -std=gnu++1y -std=c++0x -fexceptions -frtti -MMD -MF ./Release/.deps/Release/obj.target/libsass/src/libsass/src/context.o.d.raw   -c -o Release/obj.target/libsass/src/libsass/src/context.o ../src/libsass/src/context.cpp
  g++ '-DNODE_GYP_MODULE_NAME=libsass' '-DUSING_UV_SHARED=1' '-DUSING_V8_SHARED=1' '-DV8_DEPRECATION_WARNINGS=1' '-DV8_DEPRECATION_WARNINGS' '-DV8_IMMINENT_DEPRECATION_WARNINGS' '-D_LARGEFILE_SOURCE' '-D_FILE_OFFSET_BITS=64' '-DOPENSSL_NO_PINSHARED' '-DOPENSSL_THREADS' '-DLIBSASS_VERSION="3.5.4"' -I/home/mattis/.node-gyp/12.14.1/include/node -I/home/mattis/.node-gyp/12.14.1/src -I/home/mattis/.node-gyp/12.14.1/deps/openssl/config -I/home/mattis/.node-gyp/12.14.1/deps/openssl/openssl/include -I/home/mattis/.node-gyp/12.14.1/deps/uv/include -I/home/mattis/.node-gyp/12.14.1/deps/zlib -I/home/mattis/.node-gyp/12.14.1/deps/v8/include -I../src/libsass/include  -fPIC -pthread -Wall -Wextra -Wno-unused-parameter -m64 -O3 -fno-omit-frame-pointer -std=gnu++1y -std=c++0x -fexceptions -frtti -MMD -MF ./Release/.deps/Release/obj.target/libsass/src/libsass/src/cssize.o.d.raw   -c -o Release/obj.target/libsass/src/libsass/src/cssize.o ../src/libsass/src/cssize.cpp
  g++ '-DNODE_GYP_MODULE_NAME=libsass' '-DUSING_UV_SHARED=1' '-DUSING_V8_SHARED=1' '-DV8_DEPRECATION_WARNINGS=1' '-DV8_DEPRECATION_WARNINGS' '-DV8_IMMINENT_DEPRECATION_WARNINGS' '-D_LARGEFILE_SOURCE' '-D_FILE_OFFSET_BITS=64' '-DOPENSSL_NO_PINSHARED' '-DOPENSSL_THREADS' '-DLIBSASS_VERSION="3.5.4"' -I/home/mattis/.node-gyp/12.14.1/include/node -I/home/mattis/.node-gyp/12.14.1/src -I/home/mattis/.node-gyp/12.14.1/deps/openssl/config -I/home/mattis/.node-gyp/12.14.1/deps/openssl/openssl/include -I/home/mattis/.node-gyp/12.14.1/deps/uv/include -I/home/mattis/.node-gyp/12.14.1/deps/zlib -I/home/mattis/.node-gyp/12.14.1/deps/v8/include -I../src/libsass/include  -fPIC -pthread -Wall -Wextra -Wno-unused-parameter -m64 -O3 -fno-omit-frame-pointer -std=gnu++1y -std=c++0x -fexceptions -frtti -MMD -MF ./Release/.deps/Release/obj.target/libsass/src/libsass/src/emitter.o.d.raw   -c -o Release/obj.target/libsass/src/libsass/src/emitter.o ../src/libsass/src/emitter.cpp
  g++ '-DNODE_GYP_MODULE_NAME=libsass' '-DUSING_UV_SHARED=1' '-DUSING_V8_SHARED=1' '-DV8_DEPRECATION_WARNINGS=1' '-DV8_DEPRECATION_WARNINGS' '-DV8_IMMINENT_DEPRECATION_WARNINGS' '-D_LARGEFILE_SOURCE' '-D_FILE_OFFSET_BITS=64' '-DOPENSSL_NO_PINSHARED' '-DOPENSSL_THREADS' '-DLIBSASS_VERSION="3.5.4"' -I/home/mattis/.node-gyp/12.14.1/include/node -I/home/mattis/.node-gyp/12.14.1/src -I/home/mattis/.node-gyp/12.14.1/deps/openssl/config -I/home/mattis/.node-gyp/12.14.1/deps/openssl/openssl/include -I/home/mattis/.node-gyp/12.14.1/deps/uv/include -I/home/mattis/.node-gyp/12.14.1/deps/zlib -I/home/mattis/.node-gyp/12.14.1/deps/v8/include -I../src/libsass/include  -fPIC -pthread -Wall -Wextra -Wno-unused-parameter -m64 -O3 -fno-omit-frame-pointer -std=gnu++1y -std=c++0x -fexceptions -frtti -MMD -MF ./Release/.deps/Release/obj.target/libsass/src/libsass/src/environment.o.d.raw   -c -o Release/obj.target/libsass/src/libsass/src/environment.o ../src/libsass/src/environment.cpp
  g++ '-DNODE_GYP_MODULE_NAME=libsass' '-DUSING_UV_SHARED=1' '-DUSING_V8_SHARED=1' '-DV8_DEPRECATION_WARNINGS=1' '-DV8_DEPRECATION_WARNINGS' '-DV8_IMMINENT_DEPRECATION_WARNINGS' '-D_LARGEFILE_SOURCE' '-D_FILE_OFFSET_BITS=64' '-DOPENSSL_NO_PINSHARED' '-DOPENSSL_THREADS' '-DLIBSASS_VERSION="3.5.4"' -I/home/mattis/.node-gyp/12.14.1/include/node -I/home/mattis/.node-gyp/12.14.1/src -I/home/mattis/.node-gyp/12.14.1/deps/openssl/config -I/home/mattis/.node-gyp/12.14.1/deps/openssl/openssl/include -I/home/mattis/.node-gyp/12.14.1/deps/uv/include -I/home/mattis/.node-gyp/12.14.1/deps/zlib -I/home/mattis/.node-gyp/12.14.1/deps/v8/include -I../src/libsass/include  -fPIC -pthread -Wall -Wextra -Wno-unused-parameter -m64 -O3 -fno-omit-frame-pointer -std=gnu++1y -std=c++0x -fexceptions -frtti -MMD -MF ./Release/.deps/Release/obj.target/libsass/src/libsass/src/error_handling.o.d.raw   -c -o Release/obj.target/libsass/src/libsass/src/error_handling.o ../src/libsass/src/error_handling.cpp
  g++ '-DNODE_GYP_MODULE_NAME=libsass' '-DUSING_UV_SHARED=1' '-DUSING_V8_SHARED=1' '-DV8_DEPRECATION_WARNINGS=1' '-DV8_DEPRECATION_WARNINGS' '-DV8_IMMINENT_DEPRECATION_WARNINGS' '-D_LARGEFILE_SOURCE' '-D_FILE_OFFSET_BITS=64' '-DOPENSSL_NO_PINSHARED' '-DOPENSSL_THREADS' '-DLIBSASS_VERSION="3.5.4"' -I/home/mattis/.node-gyp/12.14.1/include/node -I/home/mattis/.node-gyp/12.14.1/src -I/home/mattis/.node-gyp/12.14.1/deps/openssl/config -I/home/mattis/.node-gyp/12.14.1/deps/openssl/openssl/include -I/home/mattis/.node-gyp/12.14.1/deps/uv/include -I/home/mattis/.node-gyp/12.14.1/deps/zlib -I/home/mattis/.node-gyp/12.14.1/deps/v8/include -I../src/libsass/include  -fPIC -pthread -Wall -Wextra -Wno-unused-parameter -m64 -O3 -fno-omit-frame-pointer -std=gnu++1y -std=c++0x -fexceptions -frtti -MMD -MF ./Release/.deps/Release/obj.target/libsass/src/libsass/src/eval.o.d.raw   -c -o Release/obj.target/libsass/src/libsass/src/eval.o ../src/libsass/src/eval.cpp
  g++ '-DNODE_GYP_MODULE_NAME=libsass' '-DUSING_UV_SHARED=1' '-DUSING_V8_SHARED=1' '-DV8_DEPRECATION_WARNINGS=1' '-DV8_DEPRECATION_WARNINGS' '-DV8_IMMINENT_DEPRECATION_WARNINGS' '-D_LARGEFILE_SOURCE' '-D_FILE_OFFSET_BITS=64' '-DOPENSSL_NO_PINSHARED' '-DOPENSSL_THREADS' '-DLIBSASS_VERSION="3.5.4"' -I/home/mattis/.node-gyp/12.14.1/include/node -I/home/mattis/.node-gyp/12.14.1/src -I/home/mattis/.node-gyp/12.14.1/deps/openssl/config -I/home/mattis/.node-gyp/12.14.1/deps/openssl/openssl/include -I/home/mattis/.node-gyp/12.14.1/deps/uv/include -I/home/mattis/.node-gyp/12.14.1/deps/zlib -I/home/mattis/.node-gyp/12.14.1/deps/v8/include -I../src/libsass/include  -fPIC -pthread -Wall -Wextra -Wno-unused-parameter -m64 -O3 -fno-omit-frame-pointer -std=gnu++1y -std=c++0x -fexceptions -frtti -MMD -MF ./Release/.deps/Release/obj.target/libsass/src/libsass/src/expand.o.d.raw   -c -o Release/obj.target/libsass/src/libsass/src/expand.o ../src/libsass/src/expand.cpp
  g++ '-DNODE_GYP_MODULE_NAME=libsass' '-DUSING_UV_SHARED=1' '-DUSING_V8_SHARED=1' '-DV8_DEPRECATION_WARNINGS=1' '-DV8_DEPRECATION_WARNINGS' '-DV8_IMMINENT_DEPRECATION_WARNINGS' '-D_LARGEFILE_SOURCE' '-D_FILE_OFFSET_BITS=64' '-DOPENSSL_NO_PINSHARED' '-DOPENSSL_THREADS' '-DLIBSASS_VERSION="3.5.4"' -I/home/mattis/.node-gyp/12.14.1/include/node -I/home/mattis/.node-gyp/12.14.1/src -I/home/mattis/.node-gyp/12.14.1/deps/openssl/config -I/home/mattis/.node-gyp/12.14.1/deps/openssl/openssl/include -I/home/mattis/.node-gyp/12.14.1/deps/uv/include -I/home/mattis/.node-gyp/12.14.1/deps/zlib -I/home/mattis/.node-gyp/12.14.1/deps/v8/include -I../src/libsass/include  -fPIC -pthread -Wall -Wextra -Wno-unused-parameter -m64 -O3 -fno-omit-frame-pointer -std=gnu++1y -std=c++0x -fexceptions -frtti -MMD -MF ./Release/.deps/Release/obj.target/libsass/src/libsass/src/extend.o.d.raw   -c -o Release/obj.target/libsass/src/libsass/src/extend.o ../src/libsass/src/extend.cpp
  g++ '-DNODE_GYP_MODULE_NAME=libsass' '-DUSING_UV_SHARED=1' '-DUSING_V8_SHARED=1' '-DV8_DEPRECATION_WARNINGS=1' '-DV8_DEPRECATION_WARNINGS' '-DV8_IMMINENT_DEPRECATION_WARNINGS' '-D_LARGEFILE_SOURCE' '-D_FILE_OFFSET_BITS=64' '-DOPENSSL_NO_PINSHARED' '-DOPENSSL_THREADS' '-DLIBSASS_VERSION="3.5.4"' -I/home/mattis/.node-gyp/12.14.1/include/node -I/home/mattis/.node-gyp/12.14.1/src -I/home/mattis/.node-gyp/12.14.1/deps/openssl/config -I/home/mattis/.node-gyp/12.14.1/deps/openssl/openssl/include -I/home/mattis/.node-gyp/12.14.1/deps/uv/include -I/home/mattis/.node-gyp/12.14.1/deps/zlib -I/home/mattis/.node-gyp/12.14.1/deps/v8/include -I../src/libsass/include  -fPIC -pthread -Wall -Wextra -Wno-unused-parameter -m64 -O3 -fno-omit-frame-pointer -std=gnu++1y -std=c++0x -fexceptions -frtti -MMD -MF ./Release/.deps/Release/obj.target/libsass/src/libsass/src/file.o.d.raw   -c -o Release/obj.target/libsass/src/libsass/src/file.o ../src/libsass/src/file.cpp
  g++ '-DNODE_GYP_MODULE_NAME=libsass' '-DUSING_UV_SHARED=1' '-DUSING_V8_SHARED=1' '-DV8_DEPRECATION_WARNINGS=1' '-DV8_DEPRECATION_WARNINGS' '-DV8_IMMINENT_DEPRECATION_WARNINGS' '-D_LARGEFILE_SOURCE' '-D_FILE_OFFSET_BITS=64' '-DOPENSSL_NO_PINSHARED' '-DOPENSSL_THREADS' '-DLIBSASS_VERSION="3.5.4"' -I/home/mattis/.node-gyp/12.14.1/include/node -I/home/mattis/.node-gyp/12.14.1/src -I/home/mattis/.node-gyp/12.14.1/deps/openssl/config -I/home/mattis/.node-gyp/12.14.1/deps/openssl/openssl/include -I/home/mattis/.node-gyp/12.14.1/deps/uv/include -I/home/mattis/.node-gyp/12.14.1/deps/zlib -I/home/mattis/.node-gyp/12.14.1/deps/v8/include -I../src/libsass/include  -fPIC -pthread -Wall -Wextra -Wno-unused-parameter -m64 -O3 -fno-omit-frame-pointer -std=gnu++1y -std=c++0x -fexceptions -frtti -MMD -MF ./Release/.deps/Release/obj.target/libsass/src/libsass/src/functions.o.d.raw   -c -o Release/obj.target/libsass/src/libsass/src/functions.o ../src/libsass/src/functions.cpp
  g++ '-DNODE_GYP_MODULE_NAME=libsass' '-DUSING_UV_SHARED=1' '-DUSING_V8_SHARED=1' '-DV8_DEPRECATION_WARNINGS=1' '-DV8_DEPRECATION_WARNINGS' '-DV8_IMMINENT_DEPRECATION_WARNINGS' '-D_LARGEFILE_SOURCE' '-D_FILE_OFFSET_BITS=64' '-DOPENSSL_NO_PINSHARED' '-DOPENSSL_THREADS' '-DLIBSASS_VERSION="3.5.4"' -I/home/mattis/.node-gyp/12.14.1/include/node -I/home/mattis/.node-gyp/12.14.1/src -I/home/mattis/.node-gyp/12.14.1/deps/openssl/config -I/home/mattis/.node-gyp/12.14.1/deps/openssl/openssl/include -I/home/mattis/.node-gyp/12.14.1/deps/uv/include -I/home/mattis/.node-gyp/12.14.1/deps/zlib -I/home/mattis/.node-gyp/12.14.1/deps/v8/include -I../src/libsass/include  -fPIC -pthread -Wall -Wextra -Wno-unused-parameter -m64 -O3 -fno-omit-frame-pointer -std=gnu++1y -std=c++0x -fexceptions -frtti -MMD -MF ./Release/.deps/Release/obj.target/libsass/src/libsass/src/inspect.o.d.raw   -c -o Release/obj.target/libsass/src/libsass/src/inspect.o ../src/libsass/src/inspect.cpp
  g++ '-DNODE_GYP_MODULE_NAME=libsass' '-DUSING_UV_SHARED=1' '-DUSING_V8_SHARED=1' '-DV8_DEPRECATION_WARNINGS=1' '-DV8_DEPRECATION_WARNINGS' '-DV8_IMMINENT_DEPRECATION_WARNINGS' '-D_LARGEFILE_SOURCE' '-D_FILE_OFFSET_BITS=64' '-DOPENSSL_NO_PINSHARED' '-DOPENSSL_THREADS' '-DLIBSASS_VERSION="3.5.4"' -I/home/mattis/.node-gyp/12.14.1/include/node -I/home/mattis/.node-gyp/12.14.1/src -I/home/mattis/.node-gyp/12.14.1/deps/openssl/config -I/home/mattis/.node-gyp/12.14.1/deps/openssl/openssl/include -I/home/mattis/.node-gyp/12.14.1/deps/uv/include -I/home/mattis/.node-gyp/12.14.1/deps/zlib -I/home/mattis/.node-gyp/12.14.1/deps/v8/include -I../src/libsass/include  -fPIC -pthread -Wall -Wextra -Wno-unused-parameter -m64 -O3 -fno-omit-frame-pointer -std=gnu++1y -std=c++0x -fexceptions -frtti -MMD -MF ./Release/.deps/Release/obj.target/libsass/src/libsass/src/json.o.d.raw   -c -o Release/obj.target/libsass/src/libsass/src/json.o ../src/libsass/src/json.cpp
  g++ '-DNODE_GYP_MODULE_NAME=libsass' '-DUSING_UV_SHARED=1' '-DUSING_V8_SHARED=1' '-DV8_DEPRECATION_WARNINGS=1' '-DV8_DEPRECATION_WARNINGS' '-DV8_IMMINENT_DEPRECATION_WARNINGS' '-D_LARGEFILE_SOURCE' '-D_FILE_OFFSET_BITS=64' '-DOPENSSL_NO_PINSHARED' '-DOPENSSL_THREADS' '-DLIBSASS_VERSION="3.5.4"' -I/home/mattis/.node-gyp/12.14.1/include/node -I/home/mattis/.node-gyp/12.14.1/src -I/home/mattis/.node-gyp/12.14.1/deps/openssl/config -I/home/mattis/.node-gyp/12.14.1/deps/openssl/openssl/include -I/home/mattis/.node-gyp/12.14.1/deps/uv/include -I/home/mattis/.node-gyp/12.14.1/deps/zlib -I/home/mattis/.node-gyp/12.14.1/deps/v8/include -I../src/libsass/include  -fPIC -pthread -Wall -Wextra -Wno-unused-parameter -m64 -O3 -fno-omit-frame-pointer -std=gnu++1y -std=c++0x -fexceptions -frtti -MMD -MF ./Release/.deps/Release/obj.target/libsass/src/libsass/src/lexer.o.d.raw   -c -o Release/obj.target/libsass/src/libsass/src/lexer.o ../src/libsass/src/lexer.cpp
  g++ '-DNODE_GYP_MODULE_NAME=libsass' '-DUSING_UV_SHARED=1' '-DUSING_V8_SHARED=1' '-DV8_DEPRECATION_WARNINGS=1' '-DV8_DEPRECATION_WARNINGS' '-DV8_IMMINENT_DEPRECATION_WARNINGS' '-D_LARGEFILE_SOURCE' '-D_FILE_OFFSET_BITS=64' '-DOPENSSL_NO_PINSHARED' '-DOPENSSL_THREADS' '-DLIBSASS_VERSION="3.5.4"' -I/home/mattis/.node-gyp/12.14.1/include/node -I/home/mattis/.node-gyp/12.14.1/src -I/home/mattis/.node-gyp/12.14.1/deps/openssl/config -I/home/mattis/.node-gyp/12.14.1/deps/openssl/openssl/include -I/home/mattis/.node-gyp/12.14.1/deps/uv/include -I/home/mattis/.node-gyp/12.14.1/deps/zlib -I/home/mattis/.node-gyp/12.14.1/deps/v8/include -I../src/libsass/include  -fPIC -pthread -Wall -Wextra -Wno-unused-parameter -m64 -O3 -fno-omit-frame-pointer -std=gnu++1y -std=c++0x -fexceptions -frtti -MMD -MF ./Release/.deps/Release/obj.target/libsass/src/libsass/src/listize.o.d.raw   -c -o Release/obj.target/libsass/src/libsass/src/listize.o ../src/libsass/src/listize.cpp
  g++ '-DNODE_GYP_MODULE_NAME=libsass' '-DUSING_UV_SHARED=1' '-DUSING_V8_SHARED=1' '-DV8_DEPRECATION_WARNINGS=1' '-DV8_DEPRECATION_WARNINGS' '-DV8_IMMINENT_DEPRECATION_WARNINGS' '-D_LARGEFILE_SOURCE' '-D_FILE_OFFSET_BITS=64' '-DOPENSSL_NO_PINSHARED' '-DOPENSSL_THREADS' '-DLIBSASS_VERSION="3.5.4"' -I/home/mattis/.node-gyp/12.14.1/include/node -I/home/mattis/.node-gyp/12.14.1/src -I/home/mattis/.node-gyp/12.14.1/deps/openssl/config -I/home/mattis/.node-gyp/12.14.1/deps/openssl/openssl/include -I/home/mattis/.node-gyp/12.14.1/deps/uv/include -I/home/mattis/.node-gyp/12.14.1/deps/zlib -I/home/mattis/.node-gyp/12.14.1/deps/v8/include -I../src/libsass/include  -fPIC -pthread -Wall -Wextra -Wno-unused-parameter -m64 -O3 -fno-omit-frame-pointer -std=gnu++1y -std=c++0x -fexceptions -frtti -MMD -MF ./Release/.deps/Release/obj.target/libsass/src/libsass/src/memory/SharedPtr.o.d.raw   -c -o Release/obj.target/libsass/src/libsass/src/memory/SharedPtr.o ../src/libsass/src/memory/SharedPtr.cpp
  g++ '-DNODE_GYP_MODULE_NAME=libsass' '-DUSING_UV_SHARED=1' '-DUSING_V8_SHARED=1' '-DV8_DEPRECATION_WARNINGS=1' '-DV8_DEPRECATION_WARNINGS' '-DV8_IMMINENT_DEPRECATION_WARNINGS' '-D_LARGEFILE_SOURCE' '-D_FILE_OFFSET_BITS=64' '-DOPENSSL_NO_PINSHARED' '-DOPENSSL_THREADS' '-DLIBSASS_VERSION="3.5.4"' -I/home/mattis/.node-gyp/12.14.1/include/node -I/home/mattis/.node-gyp/12.14.1/src -I/home/mattis/.node-gyp/12.14.1/deps/openssl/config -I/home/mattis/.node-gyp/12.14.1/deps/openssl/openssl/include -I/home/mattis/.node-gyp/12.14.1/deps/uv/include -I/home/mattis/.node-gyp/12.14.1/deps/zlib -I/home/mattis/.node-gyp/12.14.1/deps/v8/include -I../src/libsass/include  -fPIC -pthread -Wall -Wextra -Wno-unused-parameter -m64 -O3 -fno-omit-frame-pointer -std=gnu++1y -std=c++0x -fexceptions -frtti -MMD -MF ./Release/.deps/Release/obj.target/libsass/src/libsass/src/node.o.d.raw   -c -o Release/obj.target/libsass/src/libsass/src/node.o ../src/libsass/src/node.cpp
  g++ '-DNODE_GYP_MODULE_NAME=libsass' '-DUSING_UV_SHARED=1' '-DUSING_V8_SHARED=1' '-DV8_DEPRECATION_WARNINGS=1' '-DV8_DEPRECATION_WARNINGS' '-DV8_IMMINENT_DEPRECATION_WARNINGS' '-D_LARGEFILE_SOURCE' '-D_FILE_OFFSET_BITS=64' '-DOPENSSL_NO_PINSHARED' '-DOPENSSL_THREADS' '-DLIBSASS_VERSION="3.5.4"' -I/home/mattis/.node-gyp/12.14.1/include/node -I/home/mattis/.node-gyp/12.14.1/src -I/home/mattis/.node-gyp/12.14.1/deps/openssl/config -I/home/mattis/.node-gyp/12.14.1/deps/openssl/openssl/include -I/home/mattis/.node-gyp/12.14.1/deps/uv/include -I/home/mattis/.node-gyp/12.14.1/deps/zlib -I/home/mattis/.node-gyp/12.14.1/deps/v8/include -I../src/libsass/include  -fPIC -pthread -Wall -Wextra -Wno-unused-parameter -m64 -O3 -fno-omit-frame-pointer -std=gnu++1y -std=c++0x -fexceptions -frtti -MMD -MF ./Release/.deps/Release/obj.target/libsass/src/libsass/src/operators.o.d.raw   -c -o Release/obj.target/libsass/src/libsass/src/operators.o ../src/libsass/src/operators.cpp
  g++ '-DNODE_GYP_MODULE_NAME=libsass' '-DUSING_UV_SHARED=1' '-DUSING_V8_SHARED=1' '-DV8_DEPRECATION_WARNINGS=1' '-DV8_DEPRECATION_WARNINGS' '-DV8_IMMINENT_DEPRECATION_WARNINGS' '-D_LARGEFILE_SOURCE' '-D_FILE_OFFSET_BITS=64' '-DOPENSSL_NO_PINSHARED' '-DOPENSSL_THREADS' '-DLIBSASS_VERSION="3.5.4"' -I/home/mattis/.node-gyp/12.14.1/include/node -I/home/mattis/.node-gyp/12.14.1/src -I/home/mattis/.node-gyp/12.14.1/deps/openssl/config -I/home/mattis/.node-gyp/12.14.1/deps/openssl/openssl/include -I/home/mattis/.node-gyp/12.14.1/deps/uv/include -I/home/mattis/.node-gyp/12.14.1/deps/zlib -I/home/mattis/.node-gyp/12.14.1/deps/v8/include -I../src/libsass/include  -fPIC -pthread -Wall -Wextra -Wno-unused-parameter -m64 -O3 -fno-omit-frame-pointer -std=gnu++1y -std=c++0x -fexceptions -frtti -MMD -MF ./Release/.deps/Release/obj.target/libsass/src/libsass/src/output.o.d.raw   -c -o Release/obj.target/libsass/src/libsass/src/output.o ../src/libsass/src/output.cpp
  g++ '-DNODE_GYP_MODULE_NAME=libsass' '-DUSING_UV_SHARED=1' '-DUSING_V8_SHARED=1' '-DV8_DEPRECATION_WARNINGS=1' '-DV8_DEPRECATION_WARNINGS' '-DV8_IMMINENT_DEPRECATION_WARNINGS' '-D_LARGEFILE_SOURCE' '-D_FILE_OFFSET_BITS=64' '-DOPENSSL_NO_PINSHARED' '-DOPENSSL_THREADS' '-DLIBSASS_VERSION="3.5.4"' -I/home/mattis/.node-gyp/12.14.1/include/node -I/home/mattis/.node-gyp/12.14.1/src -I/home/mattis/.node-gyp/12.14.1/deps/openssl/config -I/home/mattis/.node-gyp/12.14.1/deps/openssl/openssl/include -I/home/mattis/.node-gyp/12.14.1/deps/uv/include -I/home/mattis/.node-gyp/12.14.1/deps/zlib -I/home/mattis/.node-gyp/12.14.1/deps/v8/include -I../src/libsass/include  -fPIC -pthread -Wall -Wextra -Wno-unused-parameter -m64 -O3 -fno-omit-frame-pointer -std=gnu++1y -std=c++0x -fexceptions -frtti -MMD -MF ./Release/.deps/Release/obj.target/libsass/src/libsass/src/parser.o.d.raw   -c -o Release/obj.target/libsass/src/libsass/src/parser.o ../src/libsass/src/parser.cpp
  g++ '-DNODE_GYP_MODULE_NAME=libsass' '-DUSING_UV_SHARED=1' '-DUSING_V8_SHARED=1' '-DV8_DEPRECATION_WARNINGS=1' '-DV8_DEPRECATION_WARNINGS' '-DV8_IMMINENT_DEPRECATION_WARNINGS' '-D_LARGEFILE_SOURCE' '-D_FILE_OFFSET_BITS=64' '-DOPENSSL_NO_PINSHARED' '-DOPENSSL_THREADS' '-DLIBSASS_VERSION="3.5.4"' -I/home/mattis/.node-gyp/12.14.1/include/node -I/home/mattis/.node-gyp/12.14.1/src -I/home/mattis/.node-gyp/12.14.1/deps/openssl/config -I/home/mattis/.node-gyp/12.14.1/deps/openssl/openssl/include -I/home/mattis/.node-gyp/12.14.1/deps/uv/include -I/home/mattis/.node-gyp/12.14.1/deps/zlib -I/home/mattis/.node-gyp/12.14.1/deps/v8/include -I../src/libsass/include  -fPIC -pthread -Wall -Wextra -Wno-unused-parameter -m64 -O3 -fno-omit-frame-pointer -std=gnu++1y -std=c++0x -fexceptions -frtti -MMD -MF ./Release/.deps/Release/obj.target/libsass/src/libsass/src/plugins.o.d.raw   -c -o Release/obj.target/libsass/src/libsass/src/plugins.o ../src/libsass/src/plugins.cpp
  g++ '-DNODE_GYP_MODULE_NAME=libsass' '-DUSING_UV_SHARED=1' '-DUSING_V8_SHARED=1' '-DV8_DEPRECATION_WARNINGS=1' '-DV8_DEPRECATION_WARNINGS' '-DV8_IMMINENT_DEPRECATION_WARNINGS' '-D_LARGEFILE_SOURCE' '-D_FILE_OFFSET_BITS=64' '-DOPENSSL_NO_PINSHARED' '-DOPENSSL_THREADS' '-DLIBSASS_VERSION="3.5.4"' -I/home/mattis/.node-gyp/12.14.1/include/node -I/home/mattis/.node-gyp/12.14.1/src -I/home/mattis/.node-gyp/12.14.1/deps/openssl/config -I/home/mattis/.node-gyp/12.14.1/deps/openssl/openssl/include -I/home/mattis/.node-gyp/12.14.1/deps/uv/include -I/home/mattis/.node-gyp/12.14.1/deps/zlib -I/home/mattis/.node-gyp/12.14.1/deps/v8/include -I../src/libsass/include  -fPIC -pthread -Wall -Wextra -Wno-unused-parameter -m64 -O3 -fno-omit-frame-pointer -std=gnu++1y -std=c++0x -fexceptions -frtti -MMD -MF ./Release/.deps/Release/obj.target/libsass/src/libsass/src/position.o.d.raw   -c -o Release/obj.target/libsass/src/libsass/src/position.o ../src/libsass/src/position.cpp
  g++ '-DNODE_GYP_MODULE_NAME=libsass' '-DUSING_UV_SHARED=1' '-DUSING_V8_SHARED=1' '-DV8_DEPRECATION_WARNINGS=1' '-DV8_DEPRECATION_WARNINGS' '-DV8_IMMINENT_DEPRECATION_WARNINGS' '-D_LARGEFILE_SOURCE' '-D_FILE_OFFSET_BITS=64' '-DOPENSSL_NO_PINSHARED' '-DOPENSSL_THREADS' '-DLIBSASS_VERSION="3.5.4"' -I/home/mattis/.node-gyp/12.14.1/include/node -I/home/mattis/.node-gyp/12.14.1/src -I/home/mattis/.node-gyp/12.14.1/deps/openssl/config -I/home/mattis/.node-gyp/12.14.1/deps/openssl/openssl/include -I/home/mattis/.node-gyp/12.14.1/deps/uv/include -I/home/mattis/.node-gyp/12.14.1/deps/zlib -I/home/mattis/.node-gyp/12.14.1/deps/v8/include -I../src/libsass/include  -fPIC -pthread -Wall -Wextra -Wno-unused-parameter -m64 -O3 -fno-omit-frame-pointer -std=gnu++1y -std=c++0x -fexceptions -frtti -MMD -MF ./Release/.deps/Release/obj.target/libsass/src/libsass/src/prelexer.o.d.raw   -c -o Release/obj.target/libsass/src/libsass/src/prelexer.o ../src/libsass/src/prelexer.cpp
  g++ '-DNODE_GYP_MODULE_NAME=libsass' '-DUSING_UV_SHARED=1' '-DUSING_V8_SHARED=1' '-DV8_DEPRECATION_WARNINGS=1' '-DV8_DEPRECATION_WARNINGS' '-DV8_IMMINENT_DEPRECATION_WARNINGS' '-D_LARGEFILE_SOURCE' '-D_FILE_OFFSET_BITS=64' '-DOPENSSL_NO_PINSHARED' '-DOPENSSL_THREADS' '-DLIBSASS_VERSION="3.5.4"' -I/home/mattis/.node-gyp/12.14.1/include/node -I/home/mattis/.node-gyp/12.14.1/src -I/home/mattis/.node-gyp/12.14.1/deps/openssl/config -I/home/mattis/.node-gyp/12.14.1/deps/openssl/openssl/include -I/home/mattis/.node-gyp/12.14.1/deps/uv/include -I/home/mattis/.node-gyp/12.14.1/deps/zlib -I/home/mattis/.node-gyp/12.14.1/deps/v8/include -I../src/libsass/include  -fPIC -pthread -Wall -Wextra -Wno-unused-parameter -m64 -O3 -fno-omit-frame-pointer -std=gnu++1y -std=c++0x -fexceptions -frtti -MMD -MF ./Release/.deps/Release/obj.target/libsass/src/libsass/src/remove_placeholders.o.d.raw   -c -o Release/obj.target/libsass/src/libsass/src/remove_placeholders.o ../src/libsass/src/remove_placeholders.cpp
  g++ '-DNODE_GYP_MODULE_NAME=libsass' '-DUSING_UV_SHARED=1' '-DUSING_V8_SHARED=1' '-DV8_DEPRECATION_WARNINGS=1' '-DV8_DEPRECATION_WARNINGS' '-DV8_IMMINENT_DEPRECATION_WARNINGS' '-D_LARGEFILE_SOURCE' '-D_FILE_OFFSET_BITS=64' '-DOPENSSL_NO_PINSHARED' '-DOPENSSL_THREADS' '-DLIBSASS_VERSION="3.5.4"' -I/home/mattis/.node-gyp/12.14.1/include/node -I/home/mattis/.node-gyp/12.14.1/src -I/home/mattis/.node-gyp/12.14.1/deps/openssl/config -I/home/mattis/.node-gyp/12.14.1/deps/openssl/openssl/include -I/home/mattis/.node-gyp/12.14.1/deps/uv/include -I/home/mattis/.node-gyp/12.14.1/deps/zlib -I/home/mattis/.node-gyp/12.14.1/deps/v8/include -I../src/libsass/include  -fPIC -pthread -Wall -Wextra -Wno-unused-parameter -m64 -O3 -fno-omit-frame-pointer -std=gnu++1y -std=c++0x -fexceptions -frtti -MMD -MF ./Release/.deps/Release/obj.target/libsass/src/libsass/src/sass.o.d.raw   -c -o Release/obj.target/libsass/src/libsass/src/sass.o ../src/libsass/src/sass.cpp
  g++ '-DNODE_GYP_MODULE_NAME=libsass' '-DUSING_UV_SHARED=1' '-DUSING_V8_SHARED=1' '-DV8_DEPRECATION_WARNINGS=1' '-DV8_DEPRECATION_WARNINGS' '-DV8_IMMINENT_DEPRECATION_WARNINGS' '-D_LARGEFILE_SOURCE' '-D_FILE_OFFSET_BITS=64' '-DOPENSSL_NO_PINSHARED' '-DOPENSSL_THREADS' '-DLIBSASS_VERSION="3.5.4"' -I/home/mattis/.node-gyp/12.14.1/include/node -I/home/mattis/.node-gyp/12.14.1/src -I/home/mattis/.node-gyp/12.14.1/deps/openssl/config -I/home/mattis/.node-gyp/12.14.1/deps/openssl/openssl/include -I/home/mattis/.node-gyp/12.14.1/deps/uv/include -I/home/mattis/.node-gyp/12.14.1/deps/zlib -I/home/mattis/.node-gyp/12.14.1/deps/v8/include -I../src/libsass/include  -fPIC -pthread -Wall -Wextra -Wno-unused-parameter -m64 -O3 -fno-omit-frame-pointer -std=gnu++1y -std=c++0x -fexceptions -frtti -MMD -MF ./Release/.deps/Release/obj.target/libsass/src/libsass/src/sass2scss.o.d.raw   -c -o Release/obj.target/libsass/src/libsass/src/sass2scss.o ../src/libsass/src/sass2scss.cpp
  g++ '-DNODE_GYP_MODULE_NAME=libsass' '-DUSING_UV_SHARED=1' '-DUSING_V8_SHARED=1' '-DV8_DEPRECATION_WARNINGS=1' '-DV8_DEPRECATION_WARNINGS' '-DV8_IMMINENT_DEPRECATION_WARNINGS' '-D_LARGEFILE_SOURCE' '-D_FILE_OFFSET_BITS=64' '-DOPENSSL_NO_PINSHARED' '-DOPENSSL_THREADS' '-DLIBSASS_VERSION="3.5.4"' -I/home/mattis/.node-gyp/12.14.1/include/node -I/home/mattis/.node-gyp/12.14.1/src -I/home/mattis/.node-gyp/12.14.1/deps/openssl/config -I/home/mattis/.node-gyp/12.14.1/deps/openssl/openssl/include -I/home/mattis/.node-gyp/12.14.1/deps/uv/include -I/home/mattis/.node-gyp/12.14.1/deps/zlib -I/home/mattis/.node-gyp/12.14.1/deps/v8/include -I../src/libsass/include  -fPIC -pthread -Wall -Wextra -Wno-unused-parameter -m64 -O3 -fno-omit-frame-pointer -std=gnu++1y -std=c++0x -fexceptions -frtti -MMD -MF ./Release/.deps/Release/obj.target/libsass/src/libsass/src/sass_context.o.d.raw   -c -o Release/obj.target/libsass/src/libsass/src/sass_context.o ../src/libsass/src/sass_context.cpp
  g++ '-DNODE_GYP_MODULE_NAME=libsass' '-DUSING_UV_SHARED=1' '-DUSING_V8_SHARED=1' '-DV8_DEPRECATION_WARNINGS=1' '-DV8_DEPRECATION_WARNINGS' '-DV8_IMMINENT_DEPRECATION_WARNINGS' '-D_LARGEFILE_SOURCE' '-D_FILE_OFFSET_BITS=64' '-DOPENSSL_NO_PINSHARED' '-DOPENSSL_THREADS' '-DLIBSASS_VERSION="3.5.4"' -I/home/mattis/.node-gyp/12.14.1/include/node -I/home/mattis/.node-gyp/12.14.1/src -I/home/mattis/.node-gyp/12.14.1/deps/openssl/config -I/home/mattis/.node-gyp/12.14.1/deps/openssl/openssl/include -I/home/mattis/.node-gyp/12.14.1/deps/uv/include -I/home/mattis/.node-gyp/12.14.1/deps/zlib -I/home/mattis/.node-gyp/12.14.1/deps/v8/include -I../src/libsass/include  -fPIC -pthread -Wall -Wextra -Wno-unused-parameter -m64 -O3 -fno-omit-frame-pointer -std=gnu++1y -std=c++0x -fexceptions -frtti -MMD -MF ./Release/.deps/Release/obj.target/libsass/src/libsass/src/sass_functions.o.d.raw   -c -o Release/obj.target/libsass/src/libsass/src/sass_functions.o ../src/libsass/src/sass_functions.cpp
  g++ '-DNODE_GYP_MODULE_NAME=libsass' '-DUSING_UV_SHARED=1' '-DUSING_V8_SHARED=1' '-DV8_DEPRECATION_WARNINGS=1' '-DV8_DEPRECATION_WARNINGS' '-DV8_IMMINENT_DEPRECATION_WARNINGS' '-D_LARGEFILE_SOURCE' '-D_FILE_OFFSET_BITS=64' '-DOPENSSL_NO_PINSHARED' '-DOPENSSL_THREADS' '-DLIBSASS_VERSION="3.5.4"' -I/home/mattis/.node-gyp/12.14.1/include/node -I/home/mattis/.node-gyp/12.14.1/src -I/home/mattis/.node-gyp/12.14.1/deps/openssl/config -I/home/mattis/.node-gyp/12.14.1/deps/openssl/openssl/include -I/home/mattis/.node-gyp/12.14.1/deps/uv/include -I/home/mattis/.node-gyp/12.14.1/deps/zlib -I/home/mattis/.node-gyp/12.14.1/deps/v8/include -I../src/libsass/include  -fPIC -pthread -Wall -Wextra -Wno-unused-parameter -m64 -O3 -fno-omit-frame-pointer -std=gnu++1y -std=c++0x -fexceptions -frtti -MMD -MF ./Release/.deps/Release/obj.target/libsass/src/libsass/src/sass_util.o.d.raw   -c -o Release/obj.target/libsass/src/libsass/src/sass_util.o ../src/libsass/src/sass_util.cpp
  g++ '-DNODE_GYP_MODULE_NAME=libsass' '-DUSING_UV_SHARED=1' '-DUSING_V8_SHARED=1' '-DV8_DEPRECATION_WARNINGS=1' '-DV8_DEPRECATION_WARNINGS' '-DV8_IMMINENT_DEPRECATION_WARNINGS' '-D_LARGEFILE_SOURCE' '-D_FILE_OFFSET_BITS=64' '-DOPENSSL_NO_PINSHARED' '-DOPENSSL_THREADS' '-DLIBSASS_VERSION="3.5.4"' -I/home/mattis/.node-gyp/12.14.1/include/node -I/home/mattis/.node-gyp/12.14.1/src -I/home/mattis/.node-gyp/12.14.1/deps/openssl/config -I/home/mattis/.node-gyp/12.14.1/deps/openssl/openssl/include -I/home/mattis/.node-gyp/12.14.1/deps/uv/include -I/home/mattis/.node-gyp/12.14.1/deps/zlib -I/home/mattis/.node-gyp/12.14.1/deps/v8/include -I../src/libsass/include  -fPIC -pthread -Wall -Wextra -Wno-unused-parameter -m64 -O3 -fno-omit-frame-pointer -std=gnu++1y -std=c++0x -fexceptions -frtti -MMD -MF ./Release/.deps/Release/obj.target/libsass/src/libsass/src/sass_values.o.d.raw   -c -o Release/obj.target/libsass/src/libsass/src/sass_values.o ../src/libsass/src/sass_values.cpp
  g++ '-DNODE_GYP_MODULE_NAME=libsass' '-DUSING_UV_SHARED=1' '-DUSING_V8_SHARED=1' '-DV8_DEPRECATION_WARNINGS=1' '-DV8_DEPRECATION_WARNINGS' '-DV8_IMMINENT_DEPRECATION_WARNINGS' '-D_LARGEFILE_SOURCE' '-D_FILE_OFFSET_BITS=64' '-DOPENSSL_NO_PINSHARED' '-DOPENSSL_THREADS' '-DLIBSASS_VERSION="3.5.4"' -I/home/mattis/.node-gyp/12.14.1/include/node -I/home/mattis/.node-gyp/12.14.1/src -I/home/mattis/.node-gyp/12.14.1/deps/openssl/config -I/home/mattis/.node-gyp/12.14.1/deps/openssl/openssl/include -I/home/mattis/.node-gyp/12.14.1/deps/uv/include -I/home/mattis/.node-gyp/12.14.1/deps/zlib -I/home/mattis/.node-gyp/12.14.1/deps/v8/include -I../src/libsass/include  -fPIC -pthread -Wall -Wextra -Wno-unused-parameter -m64 -O3 -fno-omit-frame-pointer -std=gnu++1y -std=c++0x -fexceptions -frtti -MMD -MF ./Release/.deps/Release/obj.target/libsass/src/libsass/src/source_map.o.d.raw   -c -o Release/obj.target/libsass/src/libsass/src/source_map.o ../src/libsass/src/source_map.cpp
  g++ '-DNODE_GYP_MODULE_NAME=libsass' '-DUSING_UV_SHARED=1' '-DUSING_V8_SHARED=1' '-DV8_DEPRECATION_WARNINGS=1' '-DV8_DEPRECATION_WARNINGS' '-DV8_IMMINENT_DEPRECATION_WARNINGS' '-D_LARGEFILE_SOURCE' '-D_FILE_OFFSET_BITS=64' '-DOPENSSL_NO_PINSHARED' '-DOPENSSL_THREADS' '-DLIBSASS_VERSION="3.5.4"' -I/home/mattis/.node-gyp/12.14.1/include/node -I/home/mattis/.node-gyp/12.14.1/src -I/home/mattis/.node-gyp/12.14.1/deps/openssl/config -I/home/mattis/.node-gyp/12.14.1/deps/openssl/openssl/include -I/home/mattis/.node-gyp/12.14.1/deps/uv/include -I/home/mattis/.node-gyp/12.14.1/deps/zlib -I/home/mattis/.node-gyp/12.14.1/deps/v8/include -I../src/libsass/include  -fPIC -pthread -Wall -Wextra -Wno-unused-parameter -m64 -O3 -fno-omit-frame-pointer -std=gnu++1y -std=c++0x -fexceptions -frtti -MMD -MF ./Release/.deps/Release/obj.target/libsass/src/libsass/src/subset_map.o.d.raw   -c -o Release/obj.target/libsass/src/libsass/src/subset_map.o ../src/libsass/src/subset_map.cpp
  g++ '-DNODE_GYP_MODULE_NAME=libsass' '-DUSING_UV_SHARED=1' '-DUSING_V8_SHARED=1' '-DV8_DEPRECATION_WARNINGS=1' '-DV8_DEPRECATION_WARNINGS' '-DV8_IMMINENT_DEPRECATION_WARNINGS' '-D_LARGEFILE_SOURCE' '-D_FILE_OFFSET_BITS=64' '-DOPENSSL_NO_PINSHARED' '-DOPENSSL_THREADS' '-DLIBSASS_VERSION="3.5.4"' -I/home/mattis/.node-gyp/12.14.1/include/node -I/home/mattis/.node-gyp/12.14.1/src -I/home/mattis/.node-gyp/12.14.1/deps/openssl/config -I/home/mattis/.node-gyp/12.14.1/deps/openssl/openssl/include -I/home/mattis/.node-gyp/12.14.1/deps/uv/include -I/home/mattis/.node-gyp/12.14.1/deps/zlib -I/home/mattis/.node-gyp/12.14.1/deps/v8/include -I../src/libsass/include  -fPIC -pthread -Wall -Wextra -Wno-unused-parameter -m64 -O3 -fno-omit-frame-pointer -std=gnu++1y -std=c++0x -fexceptions -frtti -MMD -MF ./Release/.deps/Release/obj.target/libsass/src/libsass/src/to_c.o.d.raw   -c -o Release/obj.target/libsass/src/libsass/src/to_c.o ../src/libsass/src/to_c.cpp
  g++ '-DNODE_GYP_MODULE_NAME=libsass' '-DUSING_UV_SHARED=1' '-DUSING_V8_SHARED=1' '-DV8_DEPRECATION_WARNINGS=1' '-DV8_DEPRECATION_WARNINGS' '-DV8_IMMINENT_DEPRECATION_WARNINGS' '-D_LARGEFILE_SOURCE' '-D_FILE_OFFSET_BITS=64' '-DOPENSSL_NO_PINSHARED' '-DOPENSSL_THREADS' '-DLIBSASS_VERSION="3.5.4"' -I/home/mattis/.node-gyp/12.14.1/include/node -I/home/mattis/.node-gyp/12.14.1/src -I/home/mattis/.node-gyp/12.14.1/deps/openssl/config -I/home/mattis/.node-gyp/12.14.1/deps/openssl/openssl/include -I/home/mattis/.node-gyp/12.14.1/deps/uv/include -I/home/mattis/.node-gyp/12.14.1/deps/zlib -I/home/mattis/.node-gyp/12.14.1/deps/v8/include -I../src/libsass/include  -fPIC -pthread -Wall -Wextra -Wno-unused-parameter -m64 -O3 -fno-omit-frame-pointer -std=gnu++1y -std=c++0x -fexceptions -frtti -MMD -MF ./Release/.deps/Release/obj.target/libsass/src/libsass/src/to_value.o.d.raw   -c -o Release/obj.target/libsass/src/libsass/src/to_value.o ../src/libsass/src/to_value.cpp
  g++ '-DNODE_GYP_MODULE_NAME=libsass' '-DUSING_UV_SHARED=1' '-DUSING_V8_SHARED=1' '-DV8_DEPRECATION_WARNINGS=1' '-DV8_DEPRECATION_WARNINGS' '-DV8_IMMINENT_DEPRECATION_WARNINGS' '-D_LARGEFILE_SOURCE' '-D_FILE_OFFSET_BITS=64' '-DOPENSSL_NO_PINSHARED' '-DOPENSSL_THREADS' '-DLIBSASS_VERSION="3.5.4"' -I/home/mattis/.node-gyp/12.14.1/include/node -I/home/mattis/.node-gyp/12.14.1/src -I/home/mattis/.node-gyp/12.14.1/deps/openssl/config -I/home/mattis/.node-gyp/12.14.1/deps/openssl/openssl/include -I/home/mattis/.node-gyp/12.14.1/deps/uv/include -I/home/mattis/.node-gyp/12.14.1/deps/zlib -I/home/mattis/.node-gyp/12.14.1/deps/v8/include -I../src/libsass/include  -fPIC -pthread -Wall -Wextra -Wno-unused-parameter -m64 -O3 -fno-omit-frame-pointer -std=gnu++1y -std=c++0x -fexceptions -frtti -MMD -MF ./Release/.deps/Release/obj.target/libsass/src/libsass/src/units.o.d.raw   -c -o Release/obj.target/libsass/src/libsass/src/units.o ../src/libsass/src/units.cpp
  g++ '-DNODE_GYP_MODULE_NAME=libsass' '-DUSING_UV_SHARED=1' '-DUSING_V8_SHARED=1' '-DV8_DEPRECATION_WARNINGS=1' '-DV8_DEPRECATION_WARNINGS' '-DV8_IMMINENT_DEPRECATION_WARNINGS' '-D_LARGEFILE_SOURCE' '-D_FILE_OFFSET_BITS=64' '-DOPENSSL_NO_PINSHARED' '-DOPENSSL_THREADS' '-DLIBSASS_VERSION="3.5.4"' -I/home/mattis/.node-gyp/12.14.1/include/node -I/home/mattis/.node-gyp/12.14.1/src -I/home/mattis/.node-gyp/12.14.1/deps/openssl/config -I/home/mattis/.node-gyp/12.14.1/deps/openssl/openssl/include -I/home/mattis/.node-gyp/12.14.1/deps/uv/include -I/home/mattis/.node-gyp/12.14.1/deps/zlib -I/home/mattis/.node-gyp/12.14.1/deps/v8/include -I../src/libsass/include  -fPIC -pthread -Wall -Wextra -Wno-unused-parameter -m64 -O3 -fno-omit-frame-pointer -std=gnu++1y -std=c++0x -fexceptions -frtti -MMD -MF ./Release/.deps/Release/obj.target/libsass/src/libsass/src/utf8_string.o.d.raw   -c -o Release/obj.target/libsass/src/libsass/src/utf8_string.o ../src/libsass/src/utf8_string.cpp
  g++ '-DNODE_GYP_MODULE_NAME=libsass' '-DUSING_UV_SHARED=1' '-DUSING_V8_SHARED=1' '-DV8_DEPRECATION_WARNINGS=1' '-DV8_DEPRECATION_WARNINGS' '-DV8_IMMINENT_DEPRECATION_WARNINGS' '-D_LARGEFILE_SOURCE' '-D_FILE_OFFSET_BITS=64' '-DOPENSSL_NO_PINSHARED' '-DOPENSSL_THREADS' '-DLIBSASS_VERSION="3.5.4"' -I/home/mattis/.node-gyp/12.14.1/include/node -I/home/mattis/.node-gyp/12.14.1/src -I/home/mattis/.node-gyp/12.14.1/deps/openssl/config -I/home/mattis/.node-gyp/12.14.1/deps/openssl/openssl/include -I/home/mattis/.node-gyp/12.14.1/deps/uv/include -I/home/mattis/.node-gyp/12.14.1/deps/zlib -I/home/mattis/.node-gyp/12.14.1/deps/v8/include -I../src/libsass/include  -fPIC -pthread -Wall -Wextra -Wno-unused-parameter -m64 -O3 -fno-omit-frame-pointer -std=gnu++1y -std=c++0x -fexceptions -frtti -MMD -MF ./Release/.deps/Release/obj.target/libsass/src/libsass/src/util.o.d.raw   -c -o Release/obj.target/libsass/src/libsass/src/util.o ../src/libsass/src/util.cpp
  g++ '-DNODE_GYP_MODULE_NAME=libsass' '-DUSING_UV_SHARED=1' '-DUSING_V8_SHARED=1' '-DV8_DEPRECATION_WARNINGS=1' '-DV8_DEPRECATION_WARNINGS' '-DV8_IMMINENT_DEPRECATION_WARNINGS' '-D_LARGEFILE_SOURCE' '-D_FILE_OFFSET_BITS=64' '-DOPENSSL_NO_PINSHARED' '-DOPENSSL_THREADS' '-DLIBSASS_VERSION="3.5.4"' -I/home/mattis/.node-gyp/12.14.1/include/node -I/home/mattis/.node-gyp/12.14.1/src -I/home/mattis/.node-gyp/12.14.1/deps/openssl/config -I/home/mattis/.node-gyp/12.14.1/deps/openssl/openssl/include -I/home/mattis/.node-gyp/12.14.1/deps/uv/include -I/home/mattis/.node-gyp/12.14.1/deps/zlib -I/home/mattis/.node-gyp/12.14.1/deps/v8/include -I../src/libsass/include  -fPIC -pthread -Wall -Wextra -Wno-unused-parameter -m64 -O3 -fno-omit-frame-pointer -std=gnu++1y -std=c++0x -fexceptions -frtti -MMD -MF ./Release/.deps/Release/obj.target/libsass/src/libsass/src/values.o.d.raw   -c -o Release/obj.target/libsass/src/libsass/src/values.o ../src/libsass/src/values.cpp
  rm -f Release/obj.target/src/sass.a && ar crs Release/obj.target/src/sass.a Release/obj.target/libsass/src/libsass/src/ast.o Release/obj.target/libsass/src/libsass/src/ast_fwd_decl.o Release/obj.target/libsass/src/libsass/src/backtrace.o Release/obj.target/libsass/src/libsass/src/base64vlq.o Release/obj.target/libsass/src/libsass/src/bind.o Release/obj.target/libsass/src/libsass/src/cencode.o Release/obj.target/libsass/src/libsass/src/check_nesting.o Release/obj.target/libsass/src/libsass/src/color_maps.o Release/obj.target/libsass/src/libsass/src/constants.o Release/obj.target/libsass/src/libsass/src/context.o Release/obj.target/libsass/src/libsass/src/cssize.o Release/obj.target/libsass/src/libsass/src/emitter.o Release/obj.target/libsass/src/libsass/src/environment.o Release/obj.target/libsass/src/libsass/src/error_handling.o Release/obj.target/libsass/src/libsass/src/eval.o Release/obj.target/libsass/src/libsass/src/expand.o Release/obj.target/libsass/src/libsass/src/extend.o Release/obj.target/libsass/src/libsass/src/file.o Release/obj.target/libsass/src/libsass/src/functions.o Release/obj.target/libsass/src/libsass/src/inspect.o Release/obj.target/libsass/src/libsass/src/json.o Release/obj.target/libsass/src/libsass/src/lexer.o Release/obj.target/libsass/src/libsass/src/listize.o Release/obj.target/libsass/src/libsass/src/memory/SharedPtr.o Release/obj.target/libsass/src/libsass/src/node.o Release/obj.target/libsass/src/libsass/src/operators.o Release/obj.target/libsass/src/libsass/src/output.o Release/obj.target/libsass/src/libsass/src/parser.o Release/obj.target/libsass/src/libsass/src/plugins.o Release/obj.target/libsass/src/libsass/src/position.o Release/obj.target/libsass/src/libsass/src/prelexer.o Release/obj.target/libsass/src/libsass/src/remove_placeholders.o Release/obj.target/libsass/src/libsass/src/sass.o Release/obj.target/libsass/src/libsass/src/sass2scss.o Release/obj.target/libsass/src/libsass/src/sass_context.o Release/obj.target/libsass/src/libsass/src/sass_functions.o Release/obj.target/libsass/src/libsass/src/sass_util.o Release/obj.target/libsass/src/libsass/src/sass_values.o Release/obj.target/libsass/src/libsass/src/source_map.o Release/obj.target/libsass/src/libsass/src/subset_map.o Release/obj.target/libsass/src/libsass/src/to_c.o Release/obj.target/libsass/src/libsass/src/to_value.o Release/obj.target/libsass/src/libsass/src/units.o Release/obj.target/libsass/src/libsass/src/utf8_string.o Release/obj.target/libsass/src/libsass/src/util.o Release/obj.target/libsass/src/libsass/src/values.o
  rm -rf "Release/sass.a" && cp -af "Release/obj.target/src/sass.a" "Release/sass.a"
  g++ '-DNODE_GYP_MODULE_NAME=binding' '-DUSING_UV_SHARED=1' '-DUSING_V8_SHARED=1' '-DV8_DEPRECATION_WARNINGS=1' '-DV8_DEPRECATION_WARNINGS' '-DV8_IMMINENT_DEPRECATION_WARNINGS' '-D_LARGEFILE_SOURCE' '-D_FILE_OFFSET_BITS=64' '-DOPENSSL_NO_PINSHARED' '-DOPENSSL_THREADS' '-DBUILDING_NODE_EXTENSION' -I/home/mattis/.node-gyp/12.14.1/include/node -I/home/mattis/.node-gyp/12.14.1/src -I/home/mattis/.node-gyp/12.14.1/deps/openssl/config -I/home/mattis/.node-gyp/12.14.1/deps/openssl/openssl/include -I/home/mattis/.node-gyp/12.14.1/deps/uv/include -I/home/mattis/.node-gyp/12.14.1/deps/zlib -I/home/mattis/.node-gyp/12.14.1/deps/v8/include -I../node_modules/nan -I../src/libsass/include  -fPIC -pthread -Wall -Wextra -Wno-unused-parameter -m64 -O3 -fno-omit-frame-pointer -fno-rtti -fno-exceptions -std=gnu++1y -std=c++0x -MMD -MF ./Release/.deps/Release/obj.target/binding/src/binding.o.d.raw   -c -o Release/obj.target/binding/src/binding.o ../src/binding.cpp
In file included from ../node_modules/nan/nan_converters.h:67:0,
                 from ../node_modules/nan/nan.h:222,
                 from ../src/binding.cpp:1:
../node_modules/nan/nan_converters_43_inl.h: In static member function ‘static Nan::imp::ToFactoryBase<v8::Boolean>::return_t Nan::imp::ToFactory<v8::Boolean>::convert(v8::Local<v8::Value>)’:
../node_modules/nan/nan_converters_43_inl.h:18:51: warning: ‘v8::MaybeLocal<v8::Boolean> v8::Value::ToBoolean(v8::Local<v8::Context>) const’ is deprecated: ToBoolean can never throw. Use Local version. [-Wdeprecated-declarations]
       val->To ## TYPE(isolate->GetCurrentContext())                            \
                                                   ^
../node_modules/nan/nan_converters_43_inl.h:22:1: note: in expansion of macro ‘X’
 X(Boolean)
 ^
In file included from /home/mattis/.node-gyp/12.14.1/include/node/v8-internal.h:14:0,
                 from /home/mattis/.node-gyp/12.14.1/include/node/v8.h:25,
                 from /home/mattis/.node-gyp/12.14.1/include/node/node.h:63,
                 from ../node_modules/nan/nan.h:53,
                 from ../src/binding.cpp:1:
/home/mattis/.node-gyp/12.14.1/include/node/v8.h:2568:59: note: declared here
                 V8_WARN_UNUSED_RESULT MaybeLocal<Boolean> ToBoolean(
                                                           ^
/home/mattis/.node-gyp/12.14.1/include/node/v8config.h:311:3: note: in definition of macro ‘V8_DEPRECATED’
   declarator __attribute__((deprecated(message)))
   ^~~~~~~~~~
In file included from ../node_modules/nan/nan_converters.h:67:0,
                 from ../node_modules/nan/nan.h:222,
                 from ../src/binding.cpp:1:
../node_modules/nan/nan_converters_43_inl.h: In static member function ‘static Nan::imp::ValueFactoryBase<bool>::return_t Nan::imp::ToFactory<bool>::convert(v8::Local<v8::Value>)’:
../node_modules/nan/nan_converters_43_inl.h:37:57: warning: ‘v8::Maybe<bool> v8::Value::BooleanValue(v8::Local<v8::Context>) const’ is deprecated: BooleanValue can never throw. Use Isolate version. [-Wdeprecated-declarations]
   return val->NAME ## Value(isolate->GetCurrentContext());                     \
                                                         ^
../node_modules/nan/nan_converters_43_inl.h:40:1: note: in expansion of macro ‘X’
 X(bool, Boolean)
 ^
In file included from /home/mattis/.node-gyp/12.14.1/include/node/v8-internal.h:14:0,
                 from /home/mattis/.node-gyp/12.14.1/include/node/v8.h:25,
                 from /home/mattis/.node-gyp/12.14.1/include/node/node.h:63,
                 from ../node_modules/nan/nan.h:53,
                 from ../src/binding.cpp:1:
/home/mattis/.node-gyp/12.14.1/include/node/v8.h:2606:51: note: declared here
                 V8_WARN_UNUSED_RESULT Maybe<bool> BooleanValue(
                                                   ^
/home/mattis/.node-gyp/12.14.1/include/node/v8config.h:311:3: note: in definition of macro ‘V8_DEPRECATED’
   declarator __attribute__((deprecated(message)))
   ^~~~~~~~~~
In file included from ../node_modules/nan/nan_new.h:189:0,
                 from ../node_modules/nan/nan.h:223,
                 from ../src/binding.cpp:1:
../node_modules/nan/nan_implementation_12_inl.h: In static member function ‘static Nan::imp::FactoryBase<v8::StringObject>::return_t Nan::imp::Factory<v8::StringObject>::New(v8::Local<v8::String>)’:
../node_modules/nan/nan_implementation_12_inl.h:356:37: error: no matching function for call to ‘v8::StringObject::New(v8::Local<v8::String>&)’
   return v8::StringObject::New(value).As<v8::StringObject>();
                                     ^
In file included from /home/mattis/.node-gyp/12.14.1/include/node/node.h:63:0,
                 from ../node_modules/nan/nan.h:53,
                 from ../src/binding.cpp:1:
/home/mattis/.node-gyp/12.14.1/include/node/v8.h:5426:23: note: candidate: static v8::Local<v8::Value> v8::StringObject::New(v8::Isolate*, v8::Local<v8::String>)
   static Local<Value> New(Isolate* isolate, Local<String> value);
                       ^~~
/home/mattis/.node-gyp/12.14.1/include/node/v8.h:5426:23: note:   candidate expects 2 arguments, 1 provided
In file included from ../node_modules/nan/nan_new.h:189:0,
                 from ../node_modules/nan/nan.h:223,
                 from ../src/binding.cpp:1:
../node_modules/nan/nan_implementation_12_inl.h:356:58: error: expected primary-expression before ‘>’ token
   return v8::StringObject::New(value).As<v8::StringObject>();
                                                          ^
../node_modules/nan/nan_implementation_12_inl.h:356:60: error: expected primary-expression before ‘)’ token
   return v8::StringObject::New(value).As<v8::StringObject>();
                                                            ^
In file included from /usr/include/c++/7/cassert:44:0,
                 from /home/mattis/.node-gyp/12.14.1/include/node/node_object_wrap.h:26,
                 from ../node_modules/nan/nan.h:55,
                 from ../src/binding.cpp:1:
../node_modules/nan/nan_object_wrap.h: In destructor ‘virtual Nan::ObjectWrap::~ObjectWrap()’:
../node_modules/nan/nan_object_wrap.h:24:25: error: ‘class Nan::Persistent<v8::Object>’ has no member named ‘IsNearDeath’
     assert(persistent().IsNearDeath());
                         ^
../node_modules/nan/nan_object_wrap.h: In static member function ‘static void Nan::ObjectWrap::WeakCallback(const v8::WeakCallbackInfo<Nan::ObjectWrap>&)’:
../node_modules/nan/nan_object_wrap.h:127:26: error: ‘class Nan::Persistent<v8::Object>’ has no member named ‘IsNearDeath’
     assert(wrap->handle_.IsNearDeath());
                          ^
binding.target.mk:129: recipe for target 'Release/obj.target/binding/src/binding.o' failed
make: *** [Release/obj.target/binding/src/binding.o] Error 1
make: Leaving directory '/home/mattis/development/main/Unishop/template-2/node_modules/node-sass/build'
gyp ERR! build error
gyp ERR! stack Error: `make` failed with exit code: 2
gyp ERR! stack     at ChildProcess.onExit (/home/mattis/development/main/Unishop/template-2/node_modules/node-gyp/lib/build.js:262:23)
gyp ERR! stack     at ChildProcess.emit (events.js:223:5)
gyp ERR! stack     at Process.ChildProcess._handle.onexit (internal/child_process.js:272:12)
gyp ERR! System Linux 5.0.4-050004-generic
gyp ERR! command "/usr/local/bin/node" "/home/mattis/development/main/Unishop/template-2/node_modules/node-gyp/bin/node-gyp.js" "rebuild" "--verbose" "--libsass_ext=" "--libsass_cflags=" "--libsass_ldflags=" "--libsass_library="
gyp ERR! cwd /home/mattis/development/main/Unishop/template-2/node_modules/node-sass
gyp ERR! node -v v12.14.1
gyp ERR! node-gyp -v v3.8.0
gyp ERR! not ok
Build failed with error code: 1
npm ERR! code ELIFECYCLE
npm ERR! errno 1
npm ERR! node-sass@4.11.0 postinstall: `node scripts/build.js`
npm ERR! Exit status 1
npm ERR!
npm ERR! Failed at the node-sass@4.11.0 postinstall script.
npm ERR! This is probably not a problem with npm. There is likely additional logging output above.

npm ERR! A complete log of this run can be found in:
npm ERR!     /home/mattis/.npm/_logs/2020-01-09T12_05_29_968Z-debug.log


On Wed, 8 Jan 2020 at 14:44, Andy Pont <andy.pont@...> wrote:
Hello,

I’m not sure whether this is a hardware issue, Linux kernel issue or a Yocto issue but as some of the finest minds are on the mailing lists I figured it was a good place to start! Enough flattery? :-)

We are using a Boundary Devices Nitrogen6X Lite (i.MX6S) board as a demo platform for a project using the linux-boundary 4.14.98 kernel.   The Boundary Devices kernel is more-or-less the same as the Freescale kernel imx_4.14.x_2.0.0_ga.

I am trying to get framebuffer rotation to work so that I can rotate the framebuffer console (on fb0) through 90 degrees.  I have the kernel configuration option CONFIG_FRAMEBUFFER_CONSOLE_ROTATION enabled and am trying to run some tests by setting values through /sys/class/graphics/fb0/rotate and /sys/class/graphics/fbcon/rotate.

I have used fb-test to display an image onto the screen and if I write “1” to /sys/class/graphics/fb0/rotate then the display flips and looks great when viewed in a mirror.  No amount of trying to set other values will rotate the screen through 90 or 270 degrees.

Is there an issue with rotation on the i.MX6 or is there a configuration setting that I am missing somewhere?

-Andy.



--
Mattis Spieler Asp
Engineer
GlucoSet AS

E-mail: mattis.asp@...
Phone: +47 412 44 648
www.glucoset.com


Disclaimer – confidentiality: The content of this email is confidential and intended for the recipient specified in this message only. It is strictly forbidden to share any part of this message with any third party, without a written consent of the sender. If you received this message by mistake, please reply to this message and delete it, so that we can ensure such a mistake does not occur in the future. If you and/or your employer has entered into a non-disclosure-agreement whereby it shall be actively specified that content shall be deemed as confidential in order to be handled as such, we hereby confirm that this mail and its attachments are considered confidential unless otherwise is specified in the above email. Thank you for your cooperation and understanding.